Jump to content
TrinityCore

academo

Plebs
  • Content Count

    9
  • Joined

  • Last visited

Community Reputation

0 Neutral

About academo

  • Rank
    Newbie
  • Birthday 09/28/1989

Profile Information

  • Gender
    Male
  • Location
    Colombia

Contact Methods

  • Skype
    academo

Recent Profile Visitors

1942 profile views
  1. I was trying to update tirnitycore version, i got some compilations errors: cmake ../../TrinityCore -DPREFIX=/home/desarrollo make -j 8 Scanning dependencies of target revision.h Scanning dependencies of target shared_pch_dephelp Scanning dependencies of target game_pch_dephelp Scanning dependencies of target jemalloc Scanning dependencies of target collision_pch_dephelp Scanning dependencies of target gsoap Scanning dependencies of target g3dlib Scanning dependencies of target authserver_pch_dephelp [ 1%] [ 1%] [ 1%] [ 2%] [ 2%] Building C object dep/jemalloc/CMakeFiles/jemalloc.dir/src/extent.c.o Building CXX object dep/gsoap/CMakeFiles/gsoap.dir/soapC.cpp.o Building CXX object src/server/collision/CMakeFiles/collision_pch_dephelp.dir/collision_pch_dephelp.cxx.o Building CXX object src/server/shared/CMakeFiles/shared_pch_dephelp.dir/shared_pch_dephelp.cxx.o [ 2%] [ 2%] Building CXX object dep/g3dlite/CMakeFiles/g3dlib.dir/source/AABox.cpp.o Building CXX object src/server/game/CMakeFiles/game_pch_dephelp.dir/game_pch_dephelp.cxx.o Building CXX object src/server/authserver/CMakeFiles/authserver_pch_dephelp.dir/authserver_pch_dephelp.cxx.o [ 2%] Built target revision.h [ 2%] Building C object dep/jemalloc/CMakeFiles/jemalloc.dir/src/huge.c.o [ 2%] Building C object dep/jemalloc/CMakeFiles/jemalloc.dir/src/chunk_dss.c.o [ 2%] Building C object dep/jemalloc/CMakeFiles/jemalloc.dir/src/mutex.c.o [ 2%] Building C object dep/jemalloc/CMakeFiles/jemalloc.dir/src/ckh.c.o [ 2%] Building C object dep/jemalloc/CMakeFiles/jemalloc.dir/src/chunk_mmap.c.o Linking CXX static library libcollision_pch_dephelp.a [ 2%] Building CXX object dep/gsoap/CMakeFiles/gsoap.dir/stdsoap2.cpp.o [ 2%] Built target collision_pch_dephelp [ 2%] Building CXX object dep/g3dlite/CMakeFiles/g3dlib.dir/source/Any.cpp.o [ 2%] Building C object dep/jemalloc/CMakeFiles/jemalloc.dir/src/chunk_swap.c.o Linking CXX static library libshared_pch_dephelp.a [ 2%] Building CXX object dep/gsoap/CMakeFiles/gsoap.dir/soapServer.cpp.o [ 2%] Building C object dep/jemalloc/CMakeFiles/jemalloc.dir/src/base.c.o [ 2%] Built target shared_pch_dephelp [ 2%] [ 3%] Building CXX object dep/g3dlite/CMakeFiles/g3dlib.dir/source/BinaryFormat.cpp.o Building C object dep/jemalloc/CMakeFiles/jemalloc.dir/src/stats.c.o Scanning dependencies of target scripts_pch_dephelp Linking CXX static library libauthserver_pch_dephelp.a [ 4%] Scanning dependencies of target worldserver_pch_dephelp Building CXX object dep/g3dlite/CMakeFiles/g3dlib.dir/source/BinaryInput.cpp.o [ 4%] Built target authserver_pch_dephelp Scanning dependencies of target pch_Generate_shared [ 4%] Generating sharedPCH.h [ 4%] [ 5%] [ 5%] Building CXX object src/server/worldserver/CMakeFiles/worldserver_pch_dephelp.dir/worldserver_pch_dephelp.cxx.o Building C object dep/jemalloc/CMakeFiles/jemalloc.dir/src/ctl.c.o [ 5%] Generating sharedPCH.h.gch/shared_Release.gch Building CXX object src/server/scripts/CMakeFiles/scripts_pch_dephelp.dir/scripts_pch_dephelp.cxx.o [ 5%] Building C object dep/jemalloc/CMakeFiles/jemalloc.dir/src/arena.c.o Linking CXX static library libworldserver_pch_dephelp.a [ 5%] Built target worldserver_pch_dephelp [ 5%] Building CXX object dep/g3dlite/CMakeFiles/g3dlib.dir/source/BinaryOutput.cpp.o [ 5%] Building C object dep/jemalloc/CMakeFiles/jemalloc.dir/src/jemalloc.c.o [ 5%] Building CXX object dep/g3dlite/CMakeFiles/g3dlib.dir/source/Box.cpp.o [ 5%] Building C object dep/jemalloc/CMakeFiles/jemalloc.dir/src/chunk.c.o In file included from /home/desarrollo/TrinityCore/src/server/scripts/PrecompiledHeaders/ScriptPCH.h:8, from /home/desarrollo/TrinityCore/build/src/server/scripts/scripts_pch_dephelp.cxx:1: /home/desarrollo/TrinityCore/src/server/game/Scripting/ScriptMgr.h: In static member function 'static void ScriptMgr::ScriptRegistry<TScript>::AddScript(TScript*)': /home/desarrollo/TrinityCore/src/server/game/Scripting/ScriptMgr.h:1010: error: 'sObjectMgr' was not declared in this scope [ 5%] Building C object dep/jemalloc/CMakeFiles/jemalloc.dir/src/tcache.c.o [ 5%] Building C object dep/jemalloc/CMakeFiles/jemalloc.dir/src/prof.c.o [ 5%] Building C object dep/jemalloc/CMakeFiles/jemalloc.dir/src/rtree.c.o Linking CXX static library libgame_pch_dephelp.a [ 5%] Building C object dep/jemalloc/CMakeFiles/jemalloc.dir/src/hash.c.o [ 5%] Built target pch_Generate_shared [ 5%] Building CXX object dep/g3dlite/CMakeFiles/g3dlib.dir/source/Capsule.cpp.o [ 6%] Building C object dep/jemalloc/CMakeFiles/jemalloc.dir/src/mb.c.o Linking C static library libjemalloc.a Scanning dependencies of target pch_Generate_collision [ 6%] Generating collisionPCH.h [ 6%] Generating collisionPCH.h.gch/collision_Release.gch [ 6%] Built target game_pch_dephelp [ 6%] [ 6%] Built target jemalloc Building CXX object dep/g3dlite/CMakeFiles/g3dlib.dir/source/CollisionDetection.cpp.o [ 6%] Building CXX object dep/g3dlite/CMakeFiles/g3dlib.dir/source/CoordinateFrame.cpp.o Scanning dependencies of target pch_Generate_worldserver [ 6%] Generating worldPCH.h [ 6%] Scanning dependencies of target pch_Generate_authserver Generating worldPCH.h.gch/worldserver_Release.gch [ 6%] Generating authPCH.h [ 6%] Generating authPCH.h.gch/authserver_Release.gch [ 6%] Building CXX object dep/g3dlite/CMakeFiles/g3dlib.dir/source/Crypto.cpp.o [ 6%] Building CXX object dep/g3dlite/CMakeFiles/g3dlib.dir/source/Cylinder.cpp.o [ 6%] Built target pch_Generate_collision [ 7%] Building CXX object dep/g3dlite/CMakeFiles/g3dlib.dir/source/debugAssert.cpp.o Scanning dependencies of target shared Scanning dependencies of target pch_Generate_game [ 7%] Generating gamePCH.h [ 7%] Generating gamePCH.h.gch/game_Release.gch make[2]: *** [src/server/scripts/CMakeFiles/scripts_pch_dephelp.dir/scripts_pch_dephelp.cxx.o] Error 1 make[1]: *** [src/server/scripts/CMakeFiles/scripts_pch_dephelp.dir/all] Error 2 make[1]: *** Waiting for unfinished jobs.... [ 7%] [ 7%] Building CXX object dep/g3dlite/CMakeFiles/g3dlib.dir/source/FileSystem.cpp.o Building CXX object dep/g3dlite/CMakeFiles/g3dlib.dir/source/fileutils.cpp.o [ 7%] Built target pch_Generate_worldserver [ 7%] Building CXX object dep/g3dlite/CMakeFiles/g3dlib.dir/source/format.cpp.o [ 8%] Building CXX object src/server/shared/CMakeFiles/shared.dir/Configuration/Config.cpp.o [ 8%] Building CXX object dep/g3dlite/CMakeFiles/g3dlib.dir/source/g3dfnmatch.cpp.o [ 8%] Building CXX object dep/g3dlite/CMakeFiles/g3dlib.dir/source/g3dmath.cpp.o [ 8%] Building CXX object dep/g3dlite/CMakeFiles/g3dlib.dir/source/Line.cpp.o [ 8%] Building CXX object src/server/shared/CMakeFiles/shared.dir/Cryptography/SHA1.cpp.o [ 8%] Building CXX object src/server/shared/CMakeFiles/shared.dir/Cryptography/Authentication/AuthCrypt.cpp.o [ 8%] Building CXX object dep/g3dlite/CMakeFiles/g3dlib.dir/source/LineSegment.cpp.o [ 8%] Building CXX object src/server/shared/CMakeFiles/shared.dir/Cryptography/HMACSHA1.cpp.o [ 8%] Building CXX object dep/g3dlite/CMakeFiles/g3dlib.dir/source/Log.cpp.o [ 8%] Building CXX object src/server/shared/CMakeFiles/shared.dir/Cryptography/BigNumber.cpp.o [ 9%] [ 9%] Built target pch_Generate_authserver [ 9%] Building CXX object dep/g3dlite/CMakeFiles/g3dlib.dir/source/Matrix3.cpp.o Building CXX object src/server/shared/CMakeFiles/shared.dir/Cryptography/ARC4.cpp.o [ 9%] Building CXX object src/server/shared/CMakeFiles/shared.dir/Database/MySQLConnection.cpp.o [ 9%] Building CXX object dep/g3dlite/CMakeFiles/g3dlib.dir/source/Matrix4.cpp.o [ 9%] Building CXX object src/server/shared/CMakeFiles/shared.dir/Database/DatabaseWorker.cpp.o [ 9%] Building CXX object dep/g3dlite/CMakeFiles/g3dlib.dir/source/MemoryManager.cpp.o [ 9%] Building CXX object dep/g3dlite/CMakeFiles/g3dlib.dir/source/PhysicsFrame.cpp.o Linking CXX static library libgsoap.a [ 9%] Building CXX object src/server/shared/CMakeFiles/shared.dir/Database/QueryHolder.cpp.o [ 10%] Building CXX object src/server/shared/CMakeFiles/shared.dir/Database/Transaction.cpp.o [ 10%] Built target gsoap [ 10%] Building CXX object dep/g3dlite/CMakeFiles/g3dlib.dir/source/Plane.cpp.o [ 10%] Building CXX object dep/g3dlite/CMakeFiles/g3dlib.dir/source/prompt.cpp.o [ 10%] Building CXX object src/server/shared/CMakeFiles/shared.dir/Database/Field.cpp.o [ 10%] Building CXX object src/server/shared/CMakeFiles/shared.dir/Database/Implementation/CharacterDatabase.cpp.o [ 10%] Building CXX object src/server/shared/CMakeFiles/shared.dir/Database/Implementation/LoginDatabase.cpp.o [ 10%] Building CXX object dep/g3dlite/CMakeFiles/g3dlib.dir/source/Quat.cpp.o [ 10%] Building CXX object dep/g3dlite/CMakeFiles/g3dlib.dir/source/Random.cpp.o [ 10%] Building CXX object src/server/shared/CMakeFiles/shared.dir/Database/Implementation/WorldDatabase.cpp.o [ 11%] Building CXX object dep/g3dlite/CMakeFiles/g3dlib.dir/source/Ray.cpp.o [ 11%] Building CXX object dep/g3dlite/CMakeFiles/g3dlib.dir/source/ReferenceCount.cpp.o [ 11%] Building CXX object src/server/shared/CMakeFiles/shared.dir/Database/QueryResult.cpp.o [ 11%] Building CXX object dep/g3dlite/CMakeFiles/g3dlib.dir/source/RegistryUtil.cpp.o [ 11%] Building CXX object dep/g3dlite/CMakeFiles/g3dlib.dir/source/Sphere.cpp.o [ 11%] Building CXX object dep/g3dlite/CMakeFiles/g3dlib.dir/source/stringutils.cpp.o [ 11%] Building CXX object src/server/shared/CMakeFiles/shared.dir/Database/SQLStorage.cpp.o [ 11%] Building CXX object src/server/shared/CMakeFiles/shared.dir/Database/AdhocStatement.cpp.o [ 11%] Building CXX object dep/g3dlite/CMakeFiles/g3dlib.dir/source/System.cpp.o [ 12%] Building CXX object src/server/shared/CMakeFiles/shared.dir/Database/PreparedStatement.cpp.o [ 12%] Building CXX object dep/g3dlite/CMakeFiles/g3dlib.dir/source/TextInput.cpp.o [ 12%] Building CXX object dep/g3dlite/CMakeFiles/g3dlib.dir/source/TextOutput.cpp.o [ 12%] Building CXX object dep/g3dlite/CMakeFiles/g3dlib.dir/source/Triangle.cpp.o [ 13%] Building CXX object dep/g3dlite/CMakeFiles/g3dlib.dir/source/uint128.cpp.o [ 13%] Building CXX object dep/g3dlite/CMakeFiles/g3dlib.dir/source/Vector2.cpp.o [ 13%] Building CXX object dep/g3dlite/CMakeFiles/g3dlib.dir/source/UprightFrame.cpp.o [ 13%] Building CXX object src/server/shared/CMakeFiles/shared.dir/DataStores/DBCFileLoader.cpp.o [ 13%] Building CXX object src/server/shared/CMakeFiles/shared.dir/Logging/Log.cpp.o [ 13%] Building CXX object dep/g3dlite/CMakeFiles/g3dlib.dir/source/Vector3.cpp.o [ 13%] Building CXX object src/server/shared/CMakeFiles/shared.dir/Threading/Threading.cpp.o [ 13%] [ 13%] Building CXX object src/server/shared/CMakeFiles/shared.dir/Threading/DelayExecutor.cpp.o Building CXX object dep/g3dlite/CMakeFiles/g3dlib.dir/source/Vector4.cpp.o [ 13%] Building CXX object src/server/shared/CMakeFiles/shared.dir/Utilities/EventProcessor.cpp.o [ 13%] Building CXX object src/server/shared/CMakeFiles/shared.dir/Utilities/Util.cpp.o [ 13%] Building CXX object src/server/shared/CMakeFiles/shared.dir/Utilities/ServiceWin32.cpp.o [ 13%] Building CXX object src/server/shared/CMakeFiles/shared.dir/Common.cpp.o [ 13%] Built target pch_Generate_game Linking CXX static library libshared.a Linking CXX static library libg3dlib.a [ 13%] [ 13%] Built target shared Built target g3dlib make: *** [all] Error 2 Just using normal libraries i didnt have any problem compiling before. Thank you very much for help PD: Also make a ticket on bug tracker but it says about runtime errors and any about compilations errors, i'm not sure if is about me or about trinity. Thanks and I'm sorry if wrong section.
×
×
  • Create New...