Jump to content
TrinityCore

Recommended Posts

On 21.8.2017 at 11:09 PM, Aokromes said:

no official support for vs 15.3.1 yet.

No official support by what ? CMake, Boost, TC ? 

VS is updating itself quite fast. Today it's already 15.3.2.

Share this post


Link to post
Share on other sites

That warning indeed comes from boost - there is nothing we can do about it except wait for next boost release

Share this post


Link to post
Share on other sites

Hello,

 

When i try to build the core i recive this error (i use ubuntu 16.4.3 and last rev of Trinitycore 335):

 

/home/szone/TrinityCore/TrinityCore/src/common/Collision/Maps/TileAssembler.cpp: In member function ‘bool VMAP::TileAssembler::readMapSpawns()’:
/home/szone/TrinityCore/TrinityCore/src/common/Collision/Maps/TileAssembler.cpp:227:51: warning: ignoring return value of ‘size_t fread(void*, size_t, size_t, FILE*)’, declared with attribute warn_unused_result [-Wunused-result]
             fread(&tileX, sizeof(uint32), 1, dirf);
                                                   ^
/home/szone/TrinityCore/TrinityCore/src/common/Collision/Maps/TileAssembler.cpp:228:51: warning: ignoring return value of ‘size_t fread(void*, size_t, size_t, FILE*)’, declared with attribute warn_unused_result [-Wunused-result]
             fread(&tileY, sizeof(uint32), 1, dirf);
 

 

Thank you!

 

 

 

Share this post


Link to post
Share on other sites
20 hours ago, Szone said:

Hello,

 

When i try to build the core i recive this error (i use ubuntu 16.4.3 and last rev of Trinitycore 335):

 

/home/szone/TrinityCore/TrinityCore/src/common/Collision/Maps/TileAssembler.cpp: In member function ‘bool VMAP::TileAssembler::readMapSpawns()’:
/home/szone/TrinityCore/TrinityCore/src/common/Collision/Maps/TileAssembler.cpp:227:51: warning: ignoring return value of ‘size_t fread(void*, size_t, size_t, FILE*)’, declared with attribute warn_unused_result [-Wunused-result]
             fread(&tileX, sizeof(uint32), 1, dirf);
                                                   ^
/home/szone/TrinityCore/TrinityCore/src/common/Collision/Maps/TileAssembler.cpp:228:51: warning: ignoring return value of ‘size_t fread(void*, size_t, size_t, FILE*)’, declared with attribute warn_unused_result [-Wunused-result]
             fread(&tileY, sizeof(uint32), 1, dirf);
 

 

Thank you!

 

 

 

Are you cancelling out the compile? It should continue. It will say "build failed". Otherwise, just let continue.

  • Upvote 1

Share this post


Link to post
Share on other sites
On 6/28/2017 at 7:31 PM, Aokromes said:

Or you can simply:
 

apt-get install git cmake make gcc g++ libmariadbclient-dev libssl1.0-dev libbz2-dev libreadline-dev libncurses-dev libboost-all-dev mysql-server p7zip

Doesn't appear to be the solutions for me.  Please help.

I had to switch things up a bit since I'm not using maria, but I also found that on Ubuntu 16.04 libssl1.0-dev and libncurses-dev do not exist.  

sudo apt-get install git cmake make gcc g++ libmysqlclient-dev libssl-dev libbz2-dev libreadline-dev libncurses5-dev libboost-all-dev mysql-server p7zip
Reading package lists... Done
Building dependency tree
Reading state information... Done
g++ is already the newest version (4:5.3.1-1ubuntu1).
gcc is already the newest version (4:5.3.1-1ubuntu1).
libbz2-dev is already the newest version (1.0.6-8).
libncurses5-dev is already the newest version (6.0+20160213-1ubuntu1).
libreadline-dev is already the newest version (6.3-8ubuntu2).
make is already the newest version (4.1-6).
libboost-all-dev is already the newest version (1.58.0.1ubuntu1).
p7zip is already the newest version (9.20.1~dfsg.1-4.2).
cmake is already the newest version (3.5.1-1ubuntu3).
git is already the newest version (1:2.7.4-0ubuntu1.2).
libmysqlclient-dev is already the newest version (5.7.19-0ubuntu0.16.04.1).
mysql-server is already the newest version (5.7.19-0ubuntu0.16.04.1).
libssl-dev is already the newest version (1.1.0f-2~ubuntu16.04.1+deb.sury.org+1).
The following packages were automatically installed and are no longer required:
  linux-headers-4.4.0-75 linux-headers-4.4.0-75-generic
  linux-image-4.4.0-75-generic linux-image-extra-4.4.0-75-generic
Use 'sudo apt autoremove' to remove them.
0 upgraded, 0 newly installed, 0 to remove and 0 not upgraded.

Share this post


Link to post
Share on other sites
5 hours ago, jempson said:

Doesn't appear to be the solutions for me.  Please help.

I had to switch things up a bit since I'm not using maria, but I also found that on Ubuntu 16.04 libssl1.0-dev and libncurses-dev do not exist.  

sudo apt-get install git cmake make gcc g++ libmysqlclient-dev libssl-dev libbz2-dev libreadline-dev libncurses5-dev libboost-all-dev mysql-server p7zip
Reading package lists... Done
Building dependency tree
Reading state information... Done
g++ is already the newest version (4:5.3.1-1ubuntu1).
gcc is already the newest version (4:5.3.1-1ubuntu1).
libbz2-dev is already the newest version (1.0.6-8).
libncurses5-dev is already the newest version (6.0+20160213-1ubuntu1).
libreadline-dev is already the newest version (6.3-8ubuntu2).
make is already the newest version (4.1-6).
libboost-all-dev is already the newest version (1.58.0.1ubuntu1).
p7zip is already the newest version (9.20.1~dfsg.1-4.2).
cmake is already the newest version (3.5.1-1ubuntu3).
git is already the newest version (1:2.7.4-0ubuntu1.2).
libmysqlclient-dev is already the newest version (5.7.19-0ubuntu0.16.04.1).
mysql-server is already the newest version (5.7.19-0ubuntu0.16.04.1).
libssl-dev is already the newest version (1.1.0f-2~ubuntu16.04.1+deb.sury.org+1).
The following packages were automatically installed and are no longer required:
  linux-headers-4.4.0-75 linux-headers-4.4.0-75-generic
  linux-image-4.4.0-75-generic linux-image-extra-4.4.0-75-generic
Use 'sudo apt autoremove' to remove them.
0 upgraded, 0 newly installed, 0 to remove and 0 not upgraded.

Ubuntu expert here :P
What error are you receiving? What version are you looking for?
MariaDB is just an option and your version of libssl (openssl) is just fine.
However, you will need to use a newer version of boost for Ubuntu 16.04+

Are you trying to compile 3.3.5 or master?

Share this post


Link to post
Share on other sites

Hey There,

I am trying to build master branch. I am running Ubuntu Headless Server 16.04.

It is old and solved problem with build directory but I can't get past it. I have made directory build inside and outside TrinityCore with cmake ../ -DCMAKE_INSTALL_PREFIX=/home/trinity/server. What am I doing wrong?

By the way, if you want to be sure what error message is:

configure_file attempted to configure a file:

bla bla bla cmake_uninstall.cmake into a source directory.

 

Share this post


Link to post
Share on other sites

First of all, my language is not English, it's Portuguese.

I have partially looked at the topic about core compilation errors, I have not found anything that can help me. I do not use MySQL the intalalled version, I use the ".zip" version and start it from the command line. What I pointed out the missing mysql paths to folders of my mysql ".zip"
MYSQL_EXECUTABLE = C:/Users/Henrrique/Desktop/SERVER/mysql/bin/mysqlX.exe
MYSQL_INCLUDE_DIR = C:/Users/Henrrique/Desktop/SERVER/mysql/include
MYSQL_LIBRARY = C:/Users/Henrrique/Desktop/SERVER/mysql/lib
NOTE: I also had problems with the paths to boost, pointed the missing paths and did not get any more errors, however I had to point out LINK paths in the vmap4assembler and mmaps_generator project.

The error that points to the output is:

Error    LNK1181    cannot open input file 'C:\Users\Henrrique\Desktop\SERVER\mysql\lib.obj'    authserver    C:\Users\Henrrique\Desktop\PROJECTWOW\BUILD\src\server\authserver\LINK    1
Error    LNK1181    cannot open input file 'C:\Users\Henrrique\Desktop\SERVER\mysql\lib.obj'    worldserver    C:\Users\Henrrique\Desktop\PROJECTWOW\BUILD\src\server\worldserver\LINK    1

The strange thing is this obj file: "lib.obj" it is part of mysql, I did not find this file in mysql nor in the debug_test version.

Edited by gldssgames
Add information and remove

Share this post


Link to post
Share on other sites

--- Canned message start --- It appears the issue in the original post was solved, so this thread shall be closed. Should you encounter any other difficulties, please open a new thread. --- Canned message end ---

Share this post


Link to post
Share on other sites

Dear Users!

I followed all of the steps, but heres an error named:

~/TrinityCore/build# cmake ../
CMake Error at cmake/compiler/gcc/settings.cmake:7 (message):
  GCC: TrinityCore requires version 4.9.0 to build but found 4.8.4
Call Stack (most recent call first):
  cmake/platform/unix/settings.cmake:29 (include)
  cmake/macros/CheckPlatform.cmake:13 (include)
  CMakeLists.txt:58 (include)


-- Configuring incomplete, errors occurred!
See also "/root/TrinityCore/build/CMakeFiles/CMakeOutput.log".
See also "/root/TrinityCore/build/CMakeFiles/CMakeError.log".

 

Plus, I tried to do following these steps:

http://www.ac-web.org/forums/showthread.php?175234-How-to-compile-Trinity-Core-on-Ubuntu&p=2286499#post2286499

But theres an error aswell, named: 

[email protected]:~/TrinityCore/build# make
make: *** No targets specified and no makefile found.  Stop.
[email protected]:~/TrinityCore/build# make install
make: *** No rule to make target `install'.  Stop.
 

 

Anyone have any ideas? OR anyone have a compiled linux files from master (7.1.5).

Id like to do this to work, please help me out! :(

Share this post


Link to post
Share on other sites

After a fierce and lengthy battle in which CMake for Windows won by refusing to find the BOOST folders no matter what I did,  I decided to switch to Mac where I was successful in getting past compiling with Xcode, so I have everything compiled. Unfortunately, I don't have the original 7.2.5 client and I am unable to extract maps, vmaps, etc. Not a huge problem since I already have them anyway downloaded from DevApex. And everything works.

Is it possible to run cmake in Mac but have the results made for Visual Studio? the command line has an "xcode" argument in it and given that there was no SLN file made, I gather the cmake command will have to have something like "visualstudio" or something similar. In the Trinity server for Windows tutorial, there is no reference to running cmake from the command line, I thought that if I knew what the command line looked like, I would be able to interpolate/translate for Mac, then run it on a Mac and then compile from Visual Studio.

Thanks

Share this post


Link to post
Share on other sites

Hey,

its been a while that i worked with a trinitycore but after playing some time on retail i wanted to start working with a TC 3.3.5

I installed visual 2015 and all programms i need for compilie

i installed git like the tutorial said, and also checked if the path is in

but i am getinng this cmake error:

CMake Error at cmake/macros/EnsureVersion.cmake:95 (NORMALIZE_VERSION):
NORMALIZE_VERSION Macro invoked with incorrect arguments for macro named:
NORMALIZE_VERSION
Call Stack (most recent call first):
cmake/macros/FindGit.cmake:37 (ensure_version)
CMakeLists.txt:67 (find_package)

 

Git version too old :

CMake Error at cmake/macros/FindGit.cmake:42 (message):


Git was found but is OUTDATED - did you forget to install a recent version, or setting the path to it?
Observe that for revision hash/date to work you need at least version 1.7
Call Stack (most recent call first):
CMakeLists.txt:67 (find_package)

Unbenannt.png

Share this post


Link to post
Share on other sites

The error found was: Git was found but is OUTDATED

So, what is your GIT version ? You can open a Git Bash console in Git Extensions and type there git version.

Share this post


Link to post
Share on other sites

git version 2.13.2.windows.1

" Besides the basic/default BOOST_ROOT variable did you also add a BOOST_LIBRARYDIR variable on windows? Curious. "

No

Unbenannt.png

Edited by endruil

Share this post


Link to post
Share on other sites

CMAKE fails in FindGit.cmake:

 # make sure we're using minimum the required version of git, so the "dirty-testing" will work properly
  ensure_version( "${_REQUIRED_GIT_VERSION}" "${_GIT_VERSION}" _GIT_VERSION_OK)

  # throw an error if we don't have a recent enough version of git...
  if(NOT _GIT_VERSION_OK)
    message(STATUS "Git version too old : ${_GIT_VERSION}")
    message(FATAL_ERROR "
      Git was found but is OUTDATED - did you forget to install a recent version, or setting the path to it?
      Observe that for revision hash/date to work you need at least version ${_REQUIRED_GIT_VERSION}")
  endif()
endif()

CMAKE can't find a value for ${_GIT_VERSION}. Seems to by empty in your case. Don't know why.

May it helps to reinstall Git Extensions and/or CMake following exactly the guide in TC Wiki.

BTW: Can you show the full message log of CMake before the error message ?

Share this post


Link to post
Share on other sites

Well i did it, still same error.
I am working on a new computer so i didnt had any programms installed before but i deinstalled all and installed it again.

Edited by endruil

Share this post


Link to post
Share on other sites

Before the error there should be a line like:

Found git binary : C:/Program Files (x86)/Git/cmd/git.exe

 

You can test it in a windows console with :

"C:/Program Files (x86)/Git/cmd/git.exe" --version

 

That's more or less what the CMake script is checking to determine the version.

 

Share this post


Link to post
Share on other sites

Found git binary : E:/Daniel/Programme/Git/cmd/git.exe

CMake Error at cmake/macros/EnsureVersion.cmake:95 (NORMALIZE_VERSION):
NORMALIZE_VERSION Macro invoked with incorrect arguments for macro named:
NORMALIZE_VERSION
Call Stack (most recent call first):
cmake/macros/FindGit.cmake:37 (ensure_version)
CMakeLists.txt:67 (find_package)

 

Git version too old :

CMake Error at cmake/macros/FindGit.cmake:42 (message):


Git was found but is OUTDATED - did you forget to install a recent version, or setting the path to it?
Observe that for revision hash/date to work you need at least version 1.7
Call Stack (most recent call first):
CMakeLists.txt:67 (find_package)

 

Configuring incomplete, errors occurred!

See also "E:/Daniel/Developing/TrinityCore-Cmake/CMakeFiles/CMakeOutput.log".

 

 

 

 

Unbenannt.png

Share this post


Link to post
Share on other sites

Looks for me like a bug. In your case the variable ${_GIT_VERSION} in FindGit.cmake is empty. That why there is nothing written behind "Git version too old : "

May you can wait till somebody else knows something or open a bug in the issue tracker with a link to this forum.

 

Share this post


Link to post
Share on other sites

Create an account or sign in to comment

You need to be a member in order to leave a comment

Create an account

Sign up for a new account in our community. It's easy!

Register a new account

Sign in

Already have an account? Sign in here.

Sign In Now

  • Recently Browsing   0 members

    No registered users viewing this page.

  • Similar Content

    • By 939h
      Hi,

      The chat channel Lookup for group is not available when a player isn't in a city. I tried to modify the worldserver.conf file with:
      #
      #    Channel.RestrictedLfg
      #        Description: Restrict LookupForGroup channel to characters registered in the LFG tool.
      #        Default:     1 - (Enabled, Allow join to channel only if registered in LFG)
      #                     0 - (Disabled, Allow join to channel in any time)
      Channel.RestrictedLfg = 0

      I restarted the server but it didn't help.

      Thanks
    • By meeek
      Hey, I've been trying to compile from github the core from 6.2.3/6.2.4, I'm well aware its stopped developing. I cannot get it to configure properly in CMake, nor can I obviously build it.
       
      I'd be willing to pay for help and get this working and running. I want to develop my own server on my freetime as a learning project and for entertainment. I can't find any core for WoD, sadly.. Very hard, would appreciate any quick help
       
    • By Probie_Wan_Kenobi
      I believe everything I have done up to this point has been correct. When I go to launch worldserver.exe a console window opens up for a second and closes right away and nothing else seems to have happened. I skipped a head a little in the instructions to see what is left and step 5 seems skippable since I am running this only for this computer and step 6 has me launch to a log in screen which I can not get to. I tried going to the faq but the page was not loading properly so I am forced to post here.
    • By Wark
      I'd just like to get a little insight to why so much of the current Trinitycore code doesn't match up to a few years ago.
      Now I know I'm not a pro at coding on Trinitycore and I understand that the core is open sourced but these just seem so significant and doesn't seem right to remove this stuff.
       
      Let me give an example. Lets say I'm watching this tutorial to get a little information about classes and methods that I can use when making a script. (I've also been using the Trinitycore Code Documentation as reference as well but it also seems to show the same issues)
      Although the tutorial is a little out of date, I don't see why OnGossipSelect doesn't exist anywhere in CreatureScript and that when I try to link the script to the core code it spits out this error.
      object of abstract class type "GossipTeleporter" is not allowed:
      pure virtual function "CreatureScript::GetAI" has no overrider
      The DEFINES of "ADD_GOSSIP_ITEM" and many more don't exist either.
       
      Am I missing something? All I want to know is if the core is mean't to be this way and if not should I download an older version of the core before I put to much working into my current core.
      (I downloaded my core right from the Trinitycore website tutorial)
       
      I'm currently trying to write a simple gossipteleporter that will let you talk to an npc and teleport to the given location. It's very hard to do this when so many things just don't exist within my core.
       
      EXTRA: I pasted this into a new custom script just to see if I would get errors and I got a lot of different errors: http://pastebin.com/raw/G62e0t49
      This was obtained from here: http://www.ac-web.org/forums/showthread.php?129885-Request-Teleporter-NPC-for-TrinityCore
      By no means am I looking to copy the code from the two links above, I was using them as a test to see if my core accepted them.
       
      Thanks,
      Wark
    • By Cantte
      Well ... today I was about to compile the trinity core version for WoW 4.3.4 of this repository "https://gitlab.com/trinitycore/TrinityCore_434". Download them and when you use the cmake, I generate the solution correctly. When I began to compile this went well until I got to the last step, when I was 90% practically.
      This was the error:
      Main.obj: error LNK2019: external symbol SSLeay_version unresolved referred to in the function "public: void __cdecl <lambda_4a2d53ce610f18dba0b4b4d6532c13a7> :: operator () (void) const" (?? R <lambda_4a2d53ce610f18dba0b4b4d6532c13a7> @@ QEBAXXZ)
      25> scripts.lib (cs_server.obj): error LNK2001: external symbol SSLeay_version unresolved
      25> gsoap.lib (stdsoap2.obj): error LNK2019: unresolved sk_num external symbol referenced in the tcp_connect function
      25> gsoap.lib (stdsoap2.obj): error LNK2019: unresolved sk_value external symbol referenced in the tcp_connect function
      25> gsoap.lib (stdsoap2.obj): error LNK2019: unresolved sk_pop_free external symbol referenced in the tcp_connect function
      25> gsoap.lib (stdsoap2.obj): error LNK2019: outer symbol OPENSSL_add_all_algorithms_noconf unresolved referenced in the soap_ssl_init function
      25> gsoap.lib (stdsoap2.obj): error LNK2019: external symbol SSL_load_error_strings unresolved referenced in the soap_ssl_init function
      25> gsoap.lib (stdsoap2.obj): error LNK2019: unresolved external SSLv23_method symbol referenced in the ssl_auth_init function
      25> gsoap.lib (stdsoap2.obj): error LNK2019: external symbol SSL_library_init unresolved referenced in the soap_ssl_init function
      25> gsoap.lib (stdsoap2.obj): error LNK2019: external symbol SSL_state unresolved referenced in the tcp_connect function
      25> common.lib (OpenSSLCrypto.obj): error LNK2019: external symbol CRYPTO_num_locks unresolved referred to in the function "void __cdecl OpenSSLCrypto :: threadsCleanup (void)" (? ThreadsCleanup @ OpenSSLCrypto @@ YAXXZ)
      25> common.lib (OpenSSLCrypto.obj): error LNK2019: external symbol CRYPTO_set_locking_callback unresolved referred to in the function "void __cdecl OpenSSLCrypto :: threadsCleanup (void)" (? ThreadsCleanup @ OpenSSLCrypto @@ YAXXZ)
      25> common.lib (OpenSSLCrypto.obj): error LNK2019: external symbol CRYPTO_THREADID_set_numeric unresolved referred to in the function "void __cdecl threadIdCallback (struct crypto_threadid_st *)" (? ThreadIdCallback @@ YAXPEAUcrypto_threadid_st @@@ Z)
      25> common.lib (OpenSSLCrypto.obj): error LNK2019: external symbol CRYPTO_THREADID_set_callback unresolved referenced in the function "void __cdecl OpenSSLCrypto :: threadsCleanup (void)" (? ThreadsCleanup @ OpenSSLCrypto @@ YAXXZ)
      25> common.lib (ARC4.obj): error LNK2019: external symbol EVP_CIPHER_CTX_init unresolved referred to in the function "public: __cdecl ARC4 :: ARC4 (unsigned int)" (?? 0ARC4 @@ QEAA @ I @ Z)
      25> common.lib (HmacHash.obj): error LNK2019: unresolved HMAC_CTX_init external symbol referenced in the "struct hmac_ctx_st * __cdecl HMAC_CTX_new (void)" function (? HMAC_CTX_new @@ YAPEAUhmac_ctx_st @@ XZ)
      25> common.lib (HmacHash.obj): error LNK2019: unresolved HMAC_CTX_cleanup external symbol referenced in the "void __cdecl HMAC_CTX_free (struct hmac_ctx_st *)" function (? HMAC_CTX_free @@ YAXPEAUhmac_ctx_st @@@ Z)
      25> E: \ Server-Wow \ TrinityCore_434-4.3.4 \ Build \ bin \ RelWithDebInfo \ worldserver.exe: fatal error LNK1120: 16 external unresolved
      25> Compilation of the "worldserver.vcxproj" project completed - ERROR.
      26> ------ Compile operation started: project: ALL_BUILD, configuration: RelWithDebInfo x64 ------
      26> Building Custom Rule E: /Server-Wow/TrinityCore_434-4.3.4/CMakeLists.txt
      26> CMake does not need to re-run because E: /Server-Wow/TrinityCore_434-4.3.4/Build/CMakeFiles/generate.stamp is up-to-date.
      ========== Compile: 23 correct, 3 incorrect, 0 updated, 0 omitted ==========
       
      And this is the original error in Spanish (since I use the compiler in Spanish)
       
      Main.obj : error LNK2019: símbolo externo SSLeay_version sin resolver al que se hace referencia en la función "public: void __cdecl <lambda_4a2d53ce610f18dba0b4b4d6532c13a7>::operator()(void)const " (??R<lambda_4a2d53ce610f18dba0b4b4d6532c13a7>@@QEBAXXZ)
      25>scripts.lib(cs_server.obj) : error LNK2001: símbolo externo SSLeay_version sin resolver
      25>gsoap.lib(stdsoap2.obj) : error LNK2019: símbolo externo sk_num sin resolver al que se hace referencia en la función tcp_connect
      25>gsoap.lib(stdsoap2.obj) : error LNK2019: símbolo externo sk_value sin resolver al que se hace referencia en la función tcp_connect
      25>gsoap.lib(stdsoap2.obj) : error LNK2019: símbolo externo sk_pop_free sin resolver al que se hace referencia en la función tcp_connect
      25>gsoap.lib(stdsoap2.obj) : error LNK2019: símbolo externo OPENSSL_add_all_algorithms_noconf sin resolver al que se hace referencia en la función soap_ssl_init
      25>gsoap.lib(stdsoap2.obj) : error LNK2019: símbolo externo SSL_load_error_strings sin resolver al que se hace referencia en la función soap_ssl_init
      25>gsoap.lib(stdsoap2.obj) : error LNK2019: símbolo externo SSLv23_method sin resolver al que se hace referencia en la función ssl_auth_init
      25>gsoap.lib(stdsoap2.obj) : error LNK2019: símbolo externo SSL_library_init sin resolver al que se hace referencia en la función soap_ssl_init
      25>gsoap.lib(stdsoap2.obj) : error LNK2019: símbolo externo SSL_state sin resolver al que se hace referencia en la función tcp_connect
      25>common.lib(OpenSSLCrypto.obj) : error LNK2019: símbolo externo CRYPTO_num_locks sin resolver al que se hace referencia en la función "void __cdecl OpenSSLCrypto::threadsCleanup(void)" ([email protected]@@YAXXZ)
      25>common.lib(OpenSSLCrypto.obj) : error LNK2019: símbolo externo CRYPTO_set_locking_callback sin resolver al que se hace referencia en la función "void __cdecl OpenSSLCrypto::threadsCleanup(void)" ([email protected]@@YAXXZ)
      25>common.lib(OpenSSLCrypto.obj) : error LNK2019: símbolo externo CRYPTO_THREADID_set_numeric sin resolver al que se hace referencia en la función "void __cdecl threadIdCallback(struct crypto_threadid_st *)" ([email protected]@[email protected]@@Z)
      25>common.lib(OpenSSLCrypto.obj) : error LNK2019: símbolo externo CRYPTO_THREADID_set_callback sin resolver al que se hace referencia en la función "void __cdecl OpenSSLCrypto::threadsCleanup(void)" ([email protected]@@YAXXZ)
      25>common.lib(ARC4.obj) : error LNK2019: símbolo externo EVP_CIPHER_CTX_init sin resolver al que se hace referencia en la función "public: __cdecl ARC4::ARC4(unsigned int)" ([email protected]@[email protected]@Z)
      25>common.lib(HmacHash.obj) : error LNK2019: símbolo externo HMAC_CTX_init sin resolver al que se hace referencia en la función "struct hmac_ctx_st * __cdecl HMAC_CTX_new(void)" ([email protected]@[email protected]@XZ)
      25>common.lib(HmacHash.obj) : error LNK2019: símbolo externo HMAC_CTX_cleanup sin resolver al que se hace referencia en la función "void __cdecl HMAC_CTX_free(struct hmac_ctx_st *)" ([email protected]@[email protected]@@Z)
      25>E:\Server-Wow\TrinityCore_434-4.3.4\Build\bin\RelWithDebInfo\worldserver.exe : fatal error LNK1120: 16 externos sin resolver
      25>Compilación del proyecto "worldserver.vcxproj" terminada -- ERROR.
      26>------ Operación Compilar iniciada: proyecto: ALL_BUILD, configuración: RelWithDebInfo x64 ------
      26>Building Custom Rule E:/Server-Wow/TrinityCore_434-4.3.4/CMakeLists.txt
      26>CMake does not need to re-run because E:/Server-Wow/TrinityCore_434-4.3.4/Build/CMakeFiles/generate.stamp is up-to-date.
      ========== Compilar: 23 correctos, 3 incorrectos, 0 actualizados, 0 omitidos ==========
       
       
      Thanks.
×