Jump to content
TrinityCore

Recommended Posts

Hello everyone,

I would like to know if there is any fresh trinitycore guide for compiling trinitycore server on Centos 6.I have Centos 6 and i don't know how to compile it.I know how to compile it on windows but linux is another world.Thank you.

 

To add to Guybrush.. follow the Redhat, not Debian... in case you didn't know CentOS platform.

Link to comment
Share on other sites

Hello.

 

I'm trying to compile a TrinityCore 3.3.5a server. i have compiled many times before (never on this computer) and i have never had any problems until now.

first of all i create a folder in C:/ named "Trinity" and then i create another folder in C:/ named "Build" i rightclick the Trinity folder and chose gitex clone and in repository to clone i type "https://github.com/TrinityCore/TrinityCore.git" and in Destination i type C:/Trinity and then Clone. then i open Cmake and i type C:/Trinity in "Where is the source code" field and C:/Build in "Where to build the binaries" field. then i click "Configure" and i check the "TOOLS" field and i click "Configure" again and then i click "Generate" then i go to folder C:/Build and open TrinityCore.sln with Microsoft Visual C++ 9 2008. and that was the same version i choosed with Cmake. and then i change from "Debug" to "Release" and then i click the green playmark and it gives me

 

this error's:

Error 1 error C2440: 'initializing' : cannot convert from 'std::_Tree<_Traits>::const_iterator' to 'std::_Tree<_Traits>::iterator' c:TrinitysrcserverscriptsOutlandHellfireCitadelBloodFurnaceinstance_blood_furnace.cpp 309
 
Error 2 error C2440: 'initializing' : cannot convert from 'std::_Tree<_Traits>::const_iterator' to 'std::_Tree<_Traits>::iterator' c:TrinitysrcserverscriptsOutlandHellfireCitadelBloodFurnaceinstance_blood_furnace.cpp 403
 
Error 3 fatal error LNK1181: cannot open input file '..scriptsReleasescripts.lib' worldserver
 
 
all programs i downloaded is for 32bit windows version but i'm on a 64bit computer but that should not be the problem. i have done it before with 32bit vesrion programs. the programs i have downloaded is
 
3. CMake
 
i'll download heidiSQL later when my error have been fixed. but anyway this is what i have done and i'm getting errors... i check the C:BuildsrcserverscriptsRelease folder but there is no scripts.lib file there only scripts.idb.
 
All help is very appreciated. sorry if my english is bad but i'm quite sure that everyone will understand, and also sorry for the extremly destailed info. could had made this post so much shorter but i like to explain in detail from start.
Edited by 125125
Link to comment
Share on other sites

I am getting those exact same errors. Are we the only 2 getting them?

FYI, I have been updating & compiling for a long time. I updated about a week ago & everything worked fine. I did everything the same way this time but now getting errors. I haven't added/changed any programs in a while.

I have:

MySQL 5.5.30

GITextension 2.43

Visual C++ 2008 express

CMake 2.8

OpenSSL 1.0.1c I believe

and SQLyog 11.1.1

Link to comment
Share on other sites

Ok .. i have read all the threads in this forum and i know the FAQs..

 

- I know how to build TrinityCore on OSX

- I compiled OpenSSL 1.0.1e from http://www.openssl.org

- I use GCC4.4.7

 

cmake returns:

 

 

-- Found OpenSSL library: /trinityserver/lib/libssl.1.0.0.dylib;/trinityserver/lib/libcrypto.1.0.0.dylib
-- Found OpenSSL headers: /Applications/gcc44/openssl/x86_64/include

 

 

 
All fine.. but i alwas get this error (on all my macs with OSX 10.6-10.8 on both builds m32 and m64) :
 
[  6%] Building CXX object dep/g3dlite/CMakeFiles/g3dlib.dir/source/Line.cpp.o
/Users/jeremymeile/Downloads/TrinityCore/src/server/shared/Cryptography/OpenSSLCrypto.cpp: In function 'void threadIdCallback(CRYPTO_THREADID*)':
/Users/jeremymeile/Downloads/TrinityCore/src/server/shared/Cryptography/OpenSSLCrypto.cpp:36: error: invalid conversion from '_opaque_pthread_t*' to 'long unsigned int'
/Users/jeremymeile/Downloads/TrinityCore/src/server/shared/Cryptography/OpenSSLCrypto.cpp:36: error:   initializing argument 2 of 'void CRYPTO_THREADID_set_numeric(CRYPTO_THREADID*, long unsigned int)'
make[2]: *** [src/server/shared/CMakeFiles/shared.dir/Cryptography/OpenSSLCrypto.cpp.o] Error 1
make[2]: *** Waiting for unfinished jobs....
[  6%] Building CXX object dep/g3dlite/CMakeFiles/g3dlib.dir/source/LineSegment.cpp.o

 

 

 

i also tried macports and home-brews openssl .. nothing is working

 

Any other mac users here know to fix it??

Link to comment
Share on other sites

i allready use: 

 

 

-DOPENSSL_CRYPTO_LIBRARIES="/trinityserver/lib/libcrypto.1.0.0.dylib"
-DOPENSSL_SSL_LIBRARIES="/trinityserver/lib/libssl.1.0.0.dylib"
-DOPENSSL_INCLUDE_DIR="/Applications/gcc44/openssl/x86_64/include"
-DOPENSSL_ROOT_DIR="/Applications/gcc44/openssl/x86_64"

 

 

 
/Applications/gcc44/openssl is prefix folder of my compiled openssl
i copied the libs to /trinityserver/lib/ too
 
but like i said it also fails with all other openssl 1.0.x binaries (macports, home-brew fink etc)
 
building openssl on osx (you can't do it wrong)
 
#!/bin/bash
OPENSSL_VERSION="1.0.0e"
 rm -d -f -r openssl-$OPENSSL_VERSION.tar.gz
curl -O http://www.openssl.org/source/openssl-$OPENSSL_VERSION.tar.gz
tar -xvzf openssl-$OPENSSL_VERSION.tar.gz
cd openssl-1.0.0e/
./Configure darwin64-x86_64-cc -shared --prefix=/Applications/gcc44/openssl
make -j $(sysctl -n hw.ncpu)
make install

 

 

 
Link to comment
Share on other sites

:D

 

Of course, I've also done so:

 

 

cmake ../ -DPREFIX="/trinityserver" -DTOOLS=1 -DSERVERS=1 -DSCRIPTS=1 -DWITHOUT_GIT=0 -DACE_LIBRARY="/trinityserver/lib/libACE.dylib" -DACE_INCLUDE_DIR="/Applications/gcc44/ace/include" -DREADLINE_LIBRARY="/trinityserver/lib/libreadline.6.2.dylib" -DREADLINE_INCLUDE_DIR="/Applications/gcc44/readline/include" -DMYSQL_CONFIG="/trinityserver/mysql/bin/mysql_config" -DWITH_WARNINGS=0 -DWITH_COREDEBUG=0 -DCMAKE_C_COMPILER="/Applications/gcc44/gcc/bin/gcc" -DCMAKE_CXX_COMPILER="/Applications/gcc44/gcc/bin/c++" -DUSE_SCRIPTPCH=0 -DUSE_COREPCH=0 -DOPENSSL_LIBRARIES="/trinityserver/lib/libssl.1.0.0.dylib" -DOPENSSL_CRYPTO_LIBRARIES="/trinityserver/lib/libcrypto.1.0.0.dylib" -DOPENSSL_SSL_LIBRARIES="/trinityserver/lib/libssl.1.0.0.dylib" -DOPENSSL_INCLUDE_DIR="/Applications/gcc44/openssl/x86_64/include" -DOPENSSL_ROOT_DIR="/Applications/gcc44/openssl/x86_64/bin"
 

 

 

Link to comment
Share on other sites

-- The CXX compiler identification is GNU 4.7.3
 

 

 

and same errors with gcc473 :/

 

 

/Users/jeremymeile/Downloads/TrinityCore/src/server/shared/Cryptography/OpenSSLCrypto.cpp: In function 'void threadIdCallback(CRYPTO_THREADID*)':
/Users/jeremymeile/Downloads/TrinityCore/src/server/shared/Cryptography/OpenSSLCrypto.cpp:36:55: error: invalid conversion from 'ACE_thread_t {aka _opaque_pthread_t*}' to 'long unsigned int' [-fpermissive]
In file included from /Users/jeremymeile/Downloads/TrinityCore/src/server/shared/Cryptography/OpenSSLCrypto.cpp:19:0:
/Applications/gcc44/openssl/x86_64/include/openssl/crypto.h:435:6: error:   initializing argument 2 of 'void CRYPTO_THREADID_set_numeric(CRYPTO_THREADID*, long unsigned int)' [-fpermissive]
make[2]: *** [src/server/shared/CMakeFiles/shared.dir/Cryptography/OpenSSLCrypto.cpp.o] Error 1
make[2]: *** Waiting for unfinished jobs....

 

 

Link to comment
Share on other sites

I am also recieving this issue and i am using Open SSL 1.0.0 k
This is a clean pull from the Git.
Both the master branch and 4.3.4 branch are giving the same results

 

Compiler MSVS 2010
OS: win 2008 r2 

Ram 8 gigs

DB:

TDB 4.3.4 alpha

TDB 3.3.5a

 

Commit hash Author: Vincent-Michael <[email protected]>

Date: 19 hours ago (Sat Sep 14 17:10:32 2013)
Commit hash: b3d7b047147d5d7e3cfea253c7abe25bf6c8364a
Link to comment
Share on other sites

Hey all,

 

So I sincerely apologize if this has been discussed before but I couldn't find an issue quite like this when I searched the forums.

 

I'm trying to compile a 4.3.4 build but when I compile in Visual C++ I get 2 fails. They are authserver.exe and worldserver.exe. I have followed the guides for compiling a server and tried searching for this issue but I can't seem to figure out what's causing it. I have a 64-bit system but I'm just compiling this in 32-bit to get the hang of it.

 

I'm posting the failure for worldserver.exe here since it appears the authserver.exe failure is similar. It looks like some issue with MySQL but I'm trying to figure out exactly what the issue is.

 

12>     Creating library C:/Build/src/server/worldserver/Release/worldserver.lib and object C:/Build/src/server/worldserver/Release/worldserver.exp

12>Main.obj : error LNK2019: unresolved external symbol [email protected] referenced in function "public: __thiscall DatabaseWorkerPool<class WorldDatabaseConnection>::DatabaseWorkerPool<class WorldDatabaseConnection>(void)" ([email protected]@@@@[email protected])

12>Main.obj : error LNK2019: unresolved external symbol [email protected] referenced in function "public: __thiscall DatabaseWorkerPool<class WorldDatabaseConnection>::DatabaseWorkerPool<class WorldDatabaseConnection>(void)" ([email protected]@@@@[email protected])

12>Master.obj : error LNK2019: unresolved external symbol [email protected] referenced in function "public: static void __cdecl MySQL::Library_Init(void)" ([email protected]@@SAXXZ)

12>Master.obj : error LNK2019: unresolved external symbol [email protected] referenced in function "public: static void __cdecl MySQL::Library_End(void)" ([email protected]@@SAXXZ)

12>Master.obj : error LNK2019: unresolved external symbol [email protected] referenced in function "public: bool __thiscall DatabaseWorkerPool<class WorldDatabaseConnection>::Open(class std::basic_string<char,struct std::char_traits<char>,class std::allocator<char> > const &,unsigned char,unsigned char)" ([email protected][email protected]@@@@[email protected][email protected]@[email protected]@[email protected]@[email protected]@[email protected]@[email protected])

12>game.lib(World.obj) : error LNK2019: unresolved external symbol [email protected] referenced in function "public: void __thiscall MySQLConnection::Ping(void)" ([email protected]@@QAEXXZ)

12>scripts.lib(cs_go.obj) : error LNK2001: unresolved external symbol [email protected]

12>scripts.lib(cs_ban.obj) : error LNK2001: unresolved external symbol [email protected]

12>game.lib(PlayerDump.obj) : error LNK2019: unresolved external symbol [email protected] referenced in function "private: bool __thiscall PlayerDumpWriter::DumpTable(class std::basic_string<char,struct std::char_traits<char>,class std::allocator<char> > &,unsigned int,char const *,char const *,enum DumpTableType)" ([email protected]@@[email protected][email protected]@[email protected]@[email protected]@[email protected]@[email protected]@[email protected]@@Z)

12>scripts.lib(cs_wp.obj) : error LNK2001: unresolved external symbol [email protected]

12>scripts.lib(cs_misc.obj) : error LNK2001: unresolved external symbol [email protected]

12>scripts.lib(cs_gobject.obj) : error LNK2001: unresolved external symbol [email protected]

12>game.lib(CharacterHandler.obj) : error LNK2001: unresolved external symbol [email protected]

12>game.lib(Pet.obj) : error LNK2001: unresolved external symbol [email protected]

12>game.lib(PetitionsHandler.obj) : error LNK2001: unresolved external symbol [email protected]

12>game.lib(GroupHandler.obj) : error LNK2001: unresolved external symbol [email protected]

12>shared.lib(PreparedStatement.obj) : error LNK2019: unresolved external symbol [email protected] referenced in function "public: __thiscall MySQLPreparedStatement::~MySQLPreparedStatement(void)" ([email protected]@[email protected])

12>shared.lib(MySQLConnection.obj) : error LNK2001: unresolved external symbol [email protected]

12>shared.lib(PreparedStatement.obj) : error LNK2019: unresolved external symbol [email protected] referenced in function "public: __thiscall MySQLPreparedStatement::MySQLPreparedStatement(struct st_mysql_stmt *)" ([email protected]@[email protected][email protected]@@Z)

12>shared.lib(PreparedStatement.obj) : error LNK2019: unresolved external symbol [email protected] referenced in function "public: __thiscall MySQLPreparedStatement::MySQLPreparedStatement(struct st_mysql_stmt *)" ([email protected]@[email protected][email protected]@@Z)

12>shared.lib(QueryResult.obj) : error LNK2019: unresolved external symbol [email protected] referenced in function "private: bool __thiscall PreparedResultSet::_NextRow(void)" ([email protected]@@AAE_NXZ)

12>shared.lib(QueryResult.obj) : error LNK2019: unresolved external symbol [email protected] referenced in function "private: void __thiscall ResultSet::CleanUp(void)" ([email protected]@@AAEXXZ)

12>shared.lib(MySQLConnection.obj) : error LNK2001: unresolved external symbol [email protected]

12>shared.lib(QueryResult.obj) : error LNK2019: unresolved external symbol [email protected] referenced in function "public: bool __thiscall ResultSet::NextRow(void)" ([email protected]@@QAE_NXZ)

12>shared.lib(QueryResult.obj) : error LNK2019: unresolved external symbol [email protected] referenced in function "private: void __thiscall PreparedResultSet::CleanUp(void)" ([email protected]@@AAEXXZ)

12>shared.lib(QueryResult.obj) : error LNK2019: unresolved external symbol [email protected] referenced in function "public: __thiscall PreparedResultSet::PreparedResultSet(struct st_mysql_stmt *,struct st_mysql_res *,unsigned __int64,unsigned int)" ([email protected]@[email protected][email protected]@[email protected]@[email protected])

12>shared.lib(MySQLConnection.obj) : error LNK2001: unresolved external symbol [email protected]

12>shared.lib(QueryResult.obj) : error LNK2019: unresolved external symbol [email protected] referenced in function "public: __thiscall PreparedResultSet::PreparedResultSet(struct st_mysql_stmt *,struct st_mysql_res *,unsigned __int64,unsigned int)" ([email protected]@[email protected][email protected]@[email protected]@[email protected])

12>shared.lib(QueryResult.obj) : error LNK2019: unresolved external symbol [email protected] referenced in function "public: __thiscall PreparedResultSet::PreparedResultSet(struct st_mysql_stmt *,struct st_mysql_res *,unsigned __int64,unsigned int)" ([email protected]@[email protected][email protected]@[email protected]@[email protected])

12>shared.lib(QueryResult.obj) : error LNK2019: unresolved external symbol [email protected] referenced in function "public: __thiscall PreparedResultSet::PreparedResultSet(struct st_mysql_stmt *,struct st_mysql_res *,unsigned __int64,unsigned int)" ([email protected]@[email protected][email protected]@[email protected]@[email protected])

12>shared.lib(MySQLConnection.obj) : error LNK2001: unresolved external symbol [email protected]

12>shared.lib(QueryResult.obj) : error LNK2019: unresolved external symbol [email protected] referenced in function "public: __thiscall PreparedResultSet::PreparedResultSet(struct st_mysql_stmt *,struct st_mysql_res *,unsigned __int64,unsigned int)" ([email protected]@[email protected][email protected]@[email protected]@[email protected])

12>shared.lib(MySQLConnection.obj) : error LNK2019: unresolved external symbol [email protected] referenced in function "public: virtual bool __thiscall MySQLConnection::Open(void)" ([email protected]@@UAE_NXZ)

12>shared.lib(MySQLConnection.obj) : error LNK2019: unresolved external symbol [email protected] referenced in function "public: virtual bool __thiscall MySQLConnection::Open(void)" ([email protected]@@UAE_NXZ)

12>shared.lib(MySQLConnection.obj) : error LNK2019: unresolved external symbol [email protected] referenced in function "public: virtual bool __thiscall MySQLConnection::Open(void)" ([email protected]@@UAE_NXZ)

12>shared.lib(MySQLConnection.obj) : error LNK2019: unresolved external symbol [email protected] referenced in function "public: virtual bool __thiscall MySQLConnection::Open(void)" ([email protected]@@UAE_NXZ)

12>shared.lib(MySQLConnection.obj) : error LNK2019: unresolved external symbol [email protected] referenced in function "public: virtual bool __thiscall MySQLConnection::Open(void)" ([email protected]@@UAE_NXZ)

12>shared.lib(MySQLConnection.obj) : error LNK2019: unresolved external symbol [email protected] referenced in function "public: virtual bool __thiscall MySQLConnection::Open(void)" ([email protected]@@UAE_NXZ)

12>shared.lib(MySQLConnection.obj) : error LNK2019: unresolved external symbol [email protected] referenced in function "public: virtual bool __thiscall MySQLConnection::Open(void)" ([email protected]@@UAE_NXZ)

12>shared.lib(MySQLConnection.obj) : error LNK2019: unresolved external symbol [email protected] referenced in function "public: virtual bool __thiscall MySQLConnection::Open(void)" ([email protected]@@UAE_NXZ)

12>shared.lib(MySQLConnection.obj) : error LNK2019: unresolved external symbol [email protected] referenced in function "public: virtual bool __thiscall MySQLConnection::Open(void)" ([email protected]@@UAE_NXZ)

12>shared.lib(MySQLConnection.obj) : error LNK2019: unresolved external symbol [email protected] referenced in function "private: bool __thiscall MySQLConnection::_HandleMySQLErrno(unsigned int)" ([email protected]@@[email protected])

12>shared.lib(Transaction.obj) : error LNK2001: unresolved external symbol [email protected]

12>shared.lib(MySQLConnection.obj) : error LNK2019: unresolved external symbol [email protected] referenced in function "private: bool __thiscall MySQLConnection::_HandleMySQLErrno(unsigned int)" ([email protected]@@[email protected])

12>shared.lib(MySQLConnection.obj) : error LNK2019: unresolved external symbol [email protected] referenced in function "public: bool __thiscall MySQLConnection::Execute(char const *)" ([email protected]@@[email protected])

12>shared.lib(MySQLConnection.obj) : error LNK2019: unresolved external symbol [email protected] referenced in function "public: bool __thiscall MySQLConnection::_Query(char const *,struct st_mysql_res * *,struct st_mysql_field * *,unsigned __int64 *,unsigned int *)" ([email protected]@@[email protected]@[email protected]@[email protected])

12>shared.lib(MySQLConnection.obj) : error LNK2019: unresolved external symbol [email protected] referenced in function "public: bool __thiscall MySQLConnection::_Query(char const *,struct st_mysql_res * *,struct st_mysql_field * *,unsigned __int64 *,unsigned int *)" ([email protected]@@[email protected]@[email protected]@[email protected])

12>shared.lib(MySQLConnection.obj) : error LNK2019: unresolved external symbol [email protected] referenced in function "public: bool __thiscall MySQLConnection::_Query(char const *,struct st_mysql_res * *,struct st_mysql_field * *,unsigned __int64 *,unsigned int *)" ([email protected]@@[email protected]@[email protected]@[email protected])

12>shared.lib(MySQLConnection.obj) : error LNK2019: unresolved external symbol [email protected] referenced in function "public: bool __thiscall MySQLConnection::_Query(char const *,struct st_mysql_res * *,struct st_mysql_field * *,unsigned __int64 *,unsigned int *)" ([email protected]@@[email protected]@[email protected]@[email protected])

12>shared.lib(MySQLConnection.obj) : error LNK2019: unresolved external symbol [email protected] referenced in function "protected: void __thiscall MySQLConnection::PrepareStatement(unsigned int,char const *,enum ConnectionFlags)" ([email protected]@@[email protected]@@Z)

12>shared.lib(MySQLConnection.obj) : error LNK2019: unresolved external symbol [email protected] referenced in function "protected: void __thiscall MySQLConnection::PrepareStatement(unsigned int,char const *,enum ConnectionFlags)" ([email protected]@@[email protected]@@Z)

12>shared.lib(MySQLConnection.obj) : error LNK2019: unresolved external symbol [email protected] referenced in function "public: bool __thiscall MySQLConnection::Execute(class PreparedStatement *)" ([email protected]@@[email protected]@@Z)

12>shared.lib(MySQLConnection.obj) : error LNK2019: unresolved external symbol [email protected] referenced in function "public: bool __thiscall MySQLConnection::Execute(class PreparedStatement *)" ([email protected]@@[email protected]@@Z)

12>shared.lib(MySQLConnection.obj) : error LNK2019: unresolved external symbol [email protected] referenced in function "public: bool __thiscall MySQLConnection::_Query(class PreparedStatement *,struct st_mysql_res * *,unsigned __int64 *,unsigned int *)" ([email protected]@@[email protected]@[email protected]@[email protected])

12>shared.lib(MySQLConnection.obj) : error LNK2019: unresolved external symbol [email protected] referenced in function "public: bool __thiscall MySQLConnection::_Query(class PreparedStatement *,struct st_mysql_res * *,unsigned __int64 *,unsigned int *)" (?[email protected]@@[email protected]@[email protected]@[email protected])

12>shared.lib(MySQLConnection.obj) : error LNK2019: unresolved external symbol [email protected] referenced in function "public: class PreparedResultSet * __thiscall MySQLConnection::Query(class PreparedStatement *)" ([email protected]@@[email protected]@[email protected]@@Z)

12>shared.lib(MySQLConnection.obj) : error LNK2019: unresolved external symbol [email protected] referenced in function "public: class PreparedResultSet * __thiscall MySQLConnection::Query(class PreparedStatement *)" ([email protected]@@[email protected]@[email protected]@@Z)

12>C:BuildbinReleaseworldserver.exe : fatal error LNK1120: 43 unresolved externals

========== Build: 11 succeeded, 1 failed, 0 up-to-date, 0 skipped ==========

 

OS: Windows 7 Ultimate x64

Visual C++ 2010 Express

 

 

Sorry too if this isn't the format to post these errors in. I'm fairly new to all of this and still trying to figure everything out. Thank you all in advance for any help you can provide.

 

-FKZechs

Link to comment
Share on other sites

Join the conversation

You can post now and register later. If you have an account, sign in now to post with your account.

Guest
Reply to this topic...

×   Pasted as rich text.   Paste as plain text instead

  Only 75 emoji are allowed.

×   Your link has been automatically embedded.   Display as a link instead

×   Your previous content has been restored.   Clear editor

×   You cannot paste images directly. Upload or insert images from URL.

 Share

  • Recently Browsing   0 members

    No registered users viewing this page.


  • Similar Content

    • By xgamerninjax
      Hello all, first time posting here and it's really got me scratching my head.
      I've compiled everything on my own computer, and then transferred everything to a host computer so the server can stay live. The server was running fine for a month or so and then suddenly it just crashes when it hits "Loading C++ scripts", exiting saying "caught signal 22"
      I tried setting up the host computer from scratch and transferred everything over fresh and it's still happening for some reason. (Note, I can run the server perfectly on my personal pc where I compiled it.)
      Any help would be greatly appreciated, thanks!
      3d7e3a40e2b3+_worldserver.exe_[1-4_15-19-45].dmp 3d7e3a40e2b3+_worldserver.exe_[1-4_15-19-45].txt
    • By Deer_Hunter
      Hello all,
      I just updated from the latest Git 
      Trinity Core REV. ac6baa547376 + 2020-02-21  3.3.5 Branch.
      I'm getting this error after crash.
      Problem signature:
        Problem Event Name:    APPCRASH
        Application Name:    worldserver.exe
        Application Version:    0.0.0.0
        Application Timestamp:    5e50a462
        Fault Module Name:    StackHash_f12f
        Fault Module Version:    6.3.9600.19629
        Fault Module Timestamp:    5e2fdc0d
        Exception Code:    c0000374
        Exception Offset:    PCH_9E_FROM_ntdll+0x0000000000090D0A
        OS Version:    6.3.9600.2.0.0.272.7
        Locale ID:    1033
        Additional Information 1:    f12f
        Additional Information 2:    f12f0934d3e965f73c68e60f20f2cd40
        Additional Information 3:    7595
        Additional Information 4:    7595e4d8d703db9dcd3d2f6ea540e357
      the exception code says its a Heap error,  I'm not sure how to troubleshoot this.
      Thanks
    • By 939h
      Hi,

      The chat channel Lookup for group is not available when a player isn't in a city. I tried to modify the worldserver.conf file with:
      #
      #    Channel.RestrictedLfg
      #        Description: Restrict LookupForGroup channel to characters registered in the LFG tool.
      #        Default:     1 - (Enabled, Allow join to channel only if registered in LFG)
      #                     0 - (Disabled, Allow join to channel in any time)
      Channel.RestrictedLfg = 0

      I restarted the server but it didn't help.

      Thanks
    • By meeek
      Hey, I've been trying to compile from github the core from 6.2.3/6.2.4, I'm well aware its stopped developing. I cannot get it to configure properly in CMake, nor can I obviously build it.
       
      I'd be willing to pay for help and get this working and running. I want to develop my own server on my freetime as a learning project and for entertainment. I can't find any core for WoD, sadly.. Very hard, would appreciate any quick help
       
    • By Probie_Wan_Kenobi
      I believe everything I have done up to this point has been correct. When I go to launch worldserver.exe a console window opens up for a second and closes right away and nothing else seems to have happened. I skipped a head a little in the instructions to see what is left and step 5 seems skippable since I am running this only for this computer and step 6 has me launch to a log in screen which I can not get to. I tried going to the faq but the page was not loading properly so I am forced to post here.
×
×
  • Create New...