Jump to content
TrinityCore

Recommended Posts

Okay, I've run into another problem. Everything is running great when I play locally, but when I try to set it up for players to connect over the internet it doesn't work. I've gone into my realmlist table and changed the address field to my public IP, and I changed my realmlist for my client to match. I also opened up the port listed in the realmlist table in my firewall. When I try to log in it says it cannot connect. From what I understand I've done everything right. Thanks for any help, as usual. :D

Edit: I have also forwarded ports in my modem

Edited by Valkrist

Share this post


Link to post
Share on other sites

I still can't get the error even thought i am an admin, is there any way that I can make it so remote users have full permissions or something like that.

http://support.microsoft.com/kb/867466/en -> try method 1/2.

Share this post


Link to post
Share on other sites

Everything is working as it should now. It runs, people connect, and everything is beautiful. Now I'm just researching how to fix various bugs I'm finding, bugs that are already listed/aren't actually bugs. Things like getting ICC finished, a few bugs in DK quests I've found, etc. Thanks again for all your help. :D

Share this post


Link to post
Share on other sites

ok guys, a little back story, ive compiled with success on winxp with vc 2010, but my server is win2k, so i got every thing i needed for win2k(up to and including .net 3.5) my compiler is vc 2005, and i've had a strange warning that i didnt get when i ran this for vc 2010.

------ Build started: Project: scripts, Configuration: Release Win32 ------

Compiling...

ScriptPCH.cpp

Compiling...

boss_dred.cpp

boss_tharon_ja.cpp

boss_novos.cpp

instance_drak_tharon_keep.cpp

boss_trollgore.cpp

dalaran.cpp

howling_fjord.cpp

borean_tundra.cpp

boss_eck.cpp

boss_moorabi.cpp

boss_gal_darah.cpp

boss_drakkari_colossus.cpp

instance_gundrak.cpp

boss_slad_ran.cpp

icecrown.cpp

d:\TrinityCore\TrinityCore\src\server\scripts\Northrend\icecrown.cpp(189) : warning C4305: 'argument' : truncation from 'double' to 'float'

d:\TrinityCore\TrinityCore\src\server\scripts\Northrend\icecrown.cpp(189) : warning C4305: 'argument' : truncation from 'double' to 'float'

d:\TrinityCore\TrinityCore\src\server\scripts\Northrend\icecrown.cpp(189) : warning C4305: 'argument' : truncation from 'double' to 'float'

d:\TrinityCore\TrinityCore\src\server\scripts\Northrend\icecrown.cpp(189) : warning C4305: 'argument' : truncation from 'double' to 'float'

d:\TrinityCore\TrinityCore\src\server\scripts\Northrend\icecrown.cpp(1273) : warning C4305: 'argument' : truncation from 'double' to 'float'

d:\TrinityCore\TrinityCore\src\server\scripts\Northrend\icecrown.cpp(1273) : warning C4305: 'argument' : truncation from 'double' to 'float'

d:\TrinityCore\TrinityCore\src\server\scripts\Northrend\icecrown.cpp(1273) : warning C4305: 'argument' : truncation from 'double' to 'float'

d:\TrinityCore\TrinityCore\src\server\scripts\Northrend\icecrown.cpp(1273) : warning C4305: 'argument' : truncation from 'double' to 'float'

d:\TrinityCore\TrinityCore\src\server\scripts\Northrend\icecrown.cpp(1320) : warning C4305: 'argument' : truncation from 'double' to 'float'

d:\TrinityCore\TrinityCore\src\server\scripts\Northrend\icecrown.cpp(1320) : warning C4305: 'argument' : truncation from 'double' to 'float'

d:\TrinityCore\TrinityCore\src\server\scripts\Northrend\icecrown.cpp(1320) : warning C4305: 'argument' : truncation from 'double' to 'float'

zuldrak.cpp

boss_blood_queen_lana_thel.cpp

boss_blood_prince_council.cpp

boss_professor_putricide.cpp

boss_rotface.cpp

boss_festergut.cpp

boss_deathbringer_saurfang.cpp

boss_lady_deathwhisper.cpp

boss_lord_marrowgar.cpp

icecrown_citadel_teleport.cpp

instance_icecrown_citadel.cpp

violet_hold.cpp

boss_erekem.cpp

boss_xevozz.cpp

boss_moragg.cpp

boss_ichoron.cpp

boss_cyanigosa.cpp

boss_lavanthor.cpp

instance_violet_hold.cpp

boss_zuramat.cpp

boss_amanitar.cpp

boss_elder_nadox.cpp

boss_jedoga_shadowseeker.cpp

instance_ahnkahet.cpp

boss_prince_taldaram.cpp

boss_herald_volazj.cpp

boss_anubarak.cpp

boss_hadronox.cpp

boss_krikthir_the_gatewatcher.cpp

instance_azjol_nerub.cpp

grizzly_hills.cpp

dragonblight.cpp

utgarde_keep.cpp

boss_keleseth.cpp

instance_utgarde_keep.cpp

boss_skarvald_dalronn.cpp

boss_ingvar_the_plunderer.cpp

boss_skadi.cpp

boss_ymiron.cpp

instance_pinnacle.cpp

boss_svala.cpp

boss_palehoof.cpp

sholazar_basin.cpp

boss_toravon.cpp

boss_emalon.cpp

instance_vault_of_archavon.cpp

boss_koralon.cpp

boss_archavon.cpp

crystalsong_forest.cpp

boss_noth.cpp

boss_grobbulus.cpp

instance_naxxramas.cpp

boss_sapphiron.cpp

boss_razuvious.cpp

boss_thaddius.cpp

boss_heigan.cpp

boss_kelthuzad.cpp

boss_four_horsemen.cpp

boss_gluth.cpp

boss_faerlina.cpp

boss_gothik.cpp

boss_patchwerk.cpp

boss_maexxna.cpp

boss_anubrekhan.cpp

boss_loatheb.cpp

boss_argent_challenge.cpp

instance_trial_of_the_champion.cpp

boss_black_knight.cpp

boss_grand_champions.cpp

trial_of_the_champion.cpp

instance_trial_of_the_crusader.cpp

boss_twin_valkyr.cpp

trial_of_the_crusader.cpp

boss_northrend_beasts.cpp

boss_lord_jaraxxus.cpp

boss_faction_champions.cpp

boss_anubarak_trial.cpp

boss_anomalus.cpp

boss_keristrasza.cpp

instance_nexus.cpp

boss_magus_telestra.cpp

boss_ormorok.cpp

commander_stoutbeard.cpp

commander_kolurg.cpp

instance_oculus.cpp

oculus.cpp

boss_urom.cpp

boss_varos.cpp

boss_drakos.cpp

boss_eregos.cpp

instance_eye_of_eternity.cpp

boss_malygos.cpp

boss_devourer_of_souls.cpp

instance_forge_of_souls.cpp

boss_bronjahm.cpp

forge_of_souls.cpp

instance_pit_of_saron.cpp

boss_scourgelord_tyrannus.cpp

pit_of_saron.cpp

boss_krickandick.cpp

boss_forgemaster_garfrost.cpp

boss_marwyn.cpp

halls_of_reflection.cpp

instance_halls_of_reflection.cpp

boss_falric.cpp

boss_sartharion.cpp

instance_obsidian_sanctum.cpp

halls_of_stone.cpp

boss_sjonnir.cpp

boss_maiden_of_grief.cpp

instance_halls_of_stone.cpp

boss_krystallus.cpp

boss_kologarn.cpp

boss_razorscale.cpp

boss_freya.cpp

boss_mimiron.cpp

boss_xt002.cpp

boss_flame_leviathan.cpp

boss_assembly_of_iron.cpp

boss_hodir.cpp

boss_yoggsaron.cpp

boss_auriaya.cpp

instance_ulduar.cpp

boss_algalon.cpp

boss_ignis.cpp

boss_thorim.cpp

ulduar_teleporter.cpp

boss_general_vezax.cpp

boss_loken.cpp

boss_volkhan.cpp

boss_ionar.cpp

boss_bjarngrim.cpp

instance_halls_of_lightning.cpp

storm_peaks.cpp

isle_of_conquest.cpp

zangarmarsh.cpp

netherstorm.cpp

instance_gruuls_lair.cpp

boss_gruul.cpp

boss_high_king_maulgar.cpp

blades_edge_mountains.cpp

shadowmoon_valley.cpp

boss_illidan.cpp

boss_bloodboil.cpp

boss_warlord_najentus.cpp

boss_reliquary_of_souls.cpp

instance_black_temple.cpp

boss_mother_shahraz.cpp

black_temple.cpp

boss_supremus.cpp

boss_shade_of_akama.cpp

illidari_council.cpp

boss_teron_gorefiend.cpp

boss_doomlord_kazzak.cpp

hellfire_peninsula.cpp

terokkar_forest.cpp

boss_doomwalker.cpp

boss_grandmaster_vorpil.cpp

instance_shadow_labyrinth.cpp

boss_blackheart_the_inciter.cpp

boss_ambassador_hellmaw.cpp

boss_murmur.cpp

instance_sethekk_halls.cpp

boss_darkweaver_syth.cpp

boss_tailonking_ikiss.cpp

boss_nexusprince_shaffar.cpp

boss_pandemonius.cpp

boss_exarch_maladaar.cpp

boss_shirrak_the_dead_watcher.cpp

arcatraz.cpp

instance_arcatraz.cpp

boss_harbinger_skyriss.cpp

boss_laj.cpp

boss_warp_splinter.cpp

boss_high_botanist_freywinn.cpp

the_eye.cpp

boss_kaelthas.cpp

boss_alar.cpp

boss_astromancer.cpp

boss_void_reaver.cpp

instance_the_eye.cpp

boss_gatewatcher_ironhand.cpp

instance_mechanar.cpp

boss_gatewatcher_gyrokill.cpp

boss_nethermancer_sepethrea.cpp

boss_pathaleon_the_calculator.cpp

shattrath_city.cpp

boss_the_black_stalker.cpp

boss_hungarfen.cpp

boss_morogrim_tidewalker.cpp

boss_lurker_below.cpp

boss_leotheras_the_blind.cpp

boss_lady_vashj.cpp

instance_serpent_shrine.cpp

boss_fathomlord_karathress.cpp

boss_hydross_the_unstable.cpp

boss_warlord_kalithresh.cpp

boss_hydromancer_thespia.cpp

instance_steam_vault.cpp

boss_mekgineer_steamrigger.cpp

boss_warbringer_omrogg.cpp

instance_shattered_halls.cpp

boss_nethekurse.cpp

boss_warchief_kargath_bladefist.cpp

boss_broggok.cpp

instance_blood_furnace.cpp

boss_kelidan_the_breaker.cpp

boss_the_maker.cpp

boss_vazruden_the_herald.cpp

boss_watchkeeper_gargolmar.cpp

boss_omor_the_unscarred.cpp

instance_hellfire_ramparts.cpp

boss_magtheridon.cpp

instance_magtheridons_lair.cpp

nagrand.cpp

instance_onyxias_lair.cpp

boss_onyxia.cpp

teldrassil.cpp

ashenvale.cpp

thousand_needles.cpp

winterspring.cpp

dustwallow_marsh.cpp

tanaris.cpp

boss_azuregos.cpp

felwood.cpp

durotar.cpp

wailing_caverns.cpp

instance_wailing_caverns.cpp

ungoro_crater.cpp

the_barrens.cpp

razorfen_kraul.cpp

instance_razorfen_kraul.cpp

azshara.cpp

thunder_bluff.cpp

bloodmyst_isle.cpp

mulgore.cpp

boss_kurinnaxx.cpp

boss_moam.cpp

boss_ayamiss.cpp

boss_ossirian.cpp

boss_rajaxx.cpp

instance_ruins_of_ahnqiraj.cpp

boss_buru.cpp

darkshore.cpp

boss_bug_trio.cpp

boss_ouro.cpp

boss_skeram.cpp

boss_cthun.cpp

boss_sartura.cpp

boss_twinemperors.cpp

boss_viscidus.cpp

mob_anubisath_sentinel.cpp

instance_temple_of_ahnqiraj.cpp

boss_huhuran.cpp

boss_fankriss.cpp

boss_noxxion.cpp

boss_celebras_the_cursed.cpp

boss_landslide.cpp

boss_princess_theradras.cpp

feralas.cpp

desolace.cpp

orgrimmar.cpp

azuremyst_isle.cpp

boss_aku_mai.cpp

blackfathom_deeps.cpp

boss_gelihast.cpp

instance_blackfathom_deeps.cpp

boss_kelris.cpp

boss_temporus.cpp

boss_aeonus.cpp

dark_portal.cpp

boss_chrono_lord_deja.cpp

instance_dark_portal.cpp

instance_culling_of_stratholme.cpp

culling_of_stratholme.cpp

boss_epoch.cpp

boss_mal_ganis.cpp

boss_meathook.cpp

boss_salramm.cpp

boss_infinite.cpp

boss_anetheron.cpp

boss_azgalor.cpp

boss_rage_winterchill.cpp

instance_hyjal.cpp

hyjalAI.cpp

hyjal.cpp

hyjal_trash.cpp

boss_kazrogal.cpp

boss_archimonde.cpp

boss_captain_skarloc.cpp

instance_old_hillsbrad.cpp

old_hillsbrad.cpp

boss_leutenant_drake.cpp

boss_epoch_hunter.cpp

instance_zulfarrak.cpp

zulfarrak.cpp

boss_amnennar_the_coldbringer.cpp

instance_razorfen_downs.cpp

razorfen_downs.cpp

moonglade.cpp

silithus.cpp

stonetalon_mountains.cpp

boss_terestian_illhoof.cpp

boss_moroes.cpp

bosses_opera.cpp

boss_prince_malchezaar.cpp

boss_midnight.cpp

boss_maiden_of_virtue.cpp

boss_netherspite.cpp

boss_shade_of_aran.cpp

boss_curator.cpp

karazhan.cpp

boss_nightbane.cpp

instance_karazhan.cpp

silverpine_forest.cpp

westfall.cpp

alterac_mountains.cpp

western_plaguelands.cpp

hinterlands.cpp

zulaman.cpp

boss_nalorakk.cpp

boss_janalai.cpp

instance_zulaman.cpp

boss_akilzon.cpp

boss_zuljin.cpp

boss_hexlord.cpp

boss_halazzi.cpp

stormwind_city.cpp

elwynn_forest.cpp

blasted_lands.cpp

boss_victor_nefarius.cpp

boss_flamegor.cpp

boss_nefarian.cpp

boss_vaelastrasz.cpp

instance_blackwing_lair.cpp

boss_ebonroc.cpp

boss_broodlord_lashlayer.cpp

boss_firemaw.cpp

boss_razorgore.cpp

boss_chromaggus.cpp

burning_steppes.cpp

instance_shadowfang_keep.cpp

shadowfang_keep.cpp

loch_modan.cpp

silvermoon_city.cpp

undercity.cpp

dun_morogh.cpp

boss_scorn.cpp

boss_herod.cpp

boss_arcanist_doan.cpp

boss_high_inquisitor_fairbanks.cpp

boss_houndmaster_loksey.cpp

instance_scarlet_monastery.cpp

boss_headless_horseman.cpp

boss_interrogator_vishas.cpp

boss_bloodmage_thalnos.cpp

boss_mograine_and_whitemane.cpp

boss_azshir_the_sleepless.cpp

duskwood.cpp

instance_deadmines.cpp

boss_mr_smite.cpp

deadmines.cpp

stranglethorn_vale.cpp

boss_felmyst.cpp

sunwell_plateau.cpp

boss_brutallus.cpp

boss_kalecgos.cpp

instance_sunwell_plateau.cpp

boss_muru.cpp

boss_kiljaeden.cpp

boss_eredar_twins.cpp

boss_the_beast.cpp

boss_highlord_omokk.cpp

boss_rend_blackhand.cpp

boss_gyth.cpp

boss_shadow_hunter_voshgajin.cpp

boss_overlord_wyrmthalak.cpp

boss_halycon.cpp

boss_quartermaster_zigris.cpp

boss_mother_smolderweb.cpp

boss_warmaster_voone.cpp

boss_drakkisath.cpp

boss_pyroguard_emberseer.cpp

swamp_of_sorrows.cpp

boss_archaedas.cpp

instance_uldaman.cpp

boss_ironaya.cpp

uldaman.cpp

magisters_terrace.cpp

boss_vexallus.cpp

boss_selin_fireheart.cpp

instance_magisters_terrace.cpp

boss_priestess_delrissa.cpp

boss_felblood_kaelthas.cpp

instance_sunken_temple.cpp

sunken_temple.cpp

tirisfal_glades.cpp

stratholme.cpp

boss_postmaster_malown.cpp

boss_maleki_the_pallid.cpp

boss_cannon_master_willey.cpp

boss_ramstein_the_gorger.cpp

boss_order_of_silver_hand.cpp

boss_magistrate_barthilas.cpp

boss_baron_rivendare.cpp

boss_timmy_the_cruel.cpp

boss_dathrohan_balnazzar.cpp

instance_stratholme.cpp

boss_nerubenkan.cpp

boss_baroness_anastari.cpp

boss_shazzrah.cpp

molten_core.cpp

boss_magmadar.cpp

boss_sulfuron_harbinger.cpp

instance_molten_core.cpp

boss_garr.cpp

boss_ragnaros.cpp

boss_baron_geddon.cpp

boss_majordomo_executus.cpp

boss_golemagg.cpp

boss_lucifron.cpp

boss_gehennas.cpp

eastern_plaguelands.cpp

the_scarlet_enclave.cpp

chapter1.cpp

chapter5.cpp

chapter2.cpp

ironforge.cpp

boss_magmus.cpp

boss_emperor_dagran_thaurissan.cpp

boss_moira_bronzebeard.cpp

instance_blackrock_depths.cpp

boss_ambassador_flamelash.cpp

boss_grizzle.cpp

boss_general_angerforge.cpp

boss_tomb_of_seven.cpp

boss_anubshiah.cpp

blackrock_depths.cpp

boss_gorosh_the_dervish.cpp

boss_high_interrogator_gerstahn.cpp

redridge_mountains.cpp

gnomeregan.cpp

instance_gnomeregan.cpp

arathi_highlands.cpp

wetlands.cpp

boss_thekal.cpp

boss_wushoolay.cpp

boss_jindo.cpp

instance_zulgurub.cpp

boss_venoxis.cpp

boss_gahzranka.cpp

boss_arlokk.cpp

boss_renataki.cpp

boss_grilek.cpp

boss_jeklik.cpp

boss_hazzarah.cpp

boss_marli.cpp

boss_mandokir.cpp

boss_hakkar.cpp

searing_gorge.cpp

boss_kruul.cpp

isle_of_queldanas.cpp

boss_ras_frostwhisper.cpp

boss_lorekeeper_polkelt.cpp

instance_scholomance.cpp

boss_darkmaster_gandling.cpp

boss_doctor_theolen_krastinov.cpp

boss_lord_alexei_barov.cpp

boss_kormok.cpp

boss_jandice_barov.cpp

boss_vectus.cpp

boss_illucia_barov.cpp

boss_death_knight_darkreaver.cpp

boss_instructor_malicia.cpp

boss_the_ravenian.cpp

alterac_valley.cpp

boss_vanndar.cpp

boss_drekthar.cpp

boss_balinda.cpp

boss_galvangar.cpp

eversong_woods.cpp

ghostlands.cpp

OutdoorPvPEP.cpp

OutdoorPvPHP.cpp

OutdoorPvPNA.cpp

OutdoorPvPZM.cpp

OutdoorPvPSI.cpp

OutdoorPvPTF.cpp

npcs_special.cpp

npc_taxi.cpp

npc_professions.cpp

npc_innkeeper.cpp

mob_generic_creature.cpp

item_scripts.cpp

guards.cpp

go_scripts.cpp

chat_log.cpp

boss_ysondre.cpp

boss_taerar.cpp

boss_lethon.cpp

boss_emeriss.cpp

areatrigger_scripts.cpp

achievement_scripts.cpp

ScriptedSimpleAI.cpp

ScriptedGuardAI.cpp

ScriptedFollowerAI.cpp

ScriptedCreature.cpp

ScriptedEscortAI.cpp

example_commandscript.cpp

example_spell.cpp

example_creature.cpp

example_escort.cpp

example_gossip_codebox.cpp

example_misc.cpp

cs_reload.cpp

cs_quest.cpp

cs_titles.cpp

cs_wp.cpp

cs_honor.cpp

cs_gobject.cpp

cs_event.cpp

cs_tele.cpp

cs_debug.cpp

cs_modify.cpp

cs_learn.cpp

cs_go.cpp

cs_npc.cpp

cs_gm.cpp

cs_achievement.cpp

cs_account.cpp

spell_item.cpp

spell_paladin.cpp

spell_mage.cpp

spell_priest.cpp

spell_warlock.cpp

spell_generic.cpp

spell_warrior.cpp

spell_quest.cpp

spell_dk.cpp

spell_druid.cpp

spell_rogue.cpp

spell_hunter.cpp

spell_shaman.cpp

Creating library...

Build log was saved at "file://c:\Trinity Server\src\server\scripts\scripts.dir\Release\BuildLog.htm"

scripts - 0 error(s), 11 warning(s)

now i know these are only warnings, but will this inpact my server in any way?

Edited by alysher

Share this post


Link to post
Share on other sites

ok not worrying...new issue tho

------ Build started: Project: ZERO_CHECK, Configuration: Release Win32 ------

Checking Build System

CMake does not need to re-run because C:/Trinity Server/CMakeFiles/generate.stamp is up-to-date.

CMake does not need to re-run because C:/Trinity Server/dep/CMakeFiles/generate.stamp is up-to-date.

CMake does not need to re-run because C:/Trinity Server/dep/acelite/CMakeFiles/generate.stamp is up-to-date.

CMake does not need to re-run because C:/Trinity Server/dep/acelite/ace/CMakeFiles/generate.stamp is up-to-date.

CMake does not need to re-run because C:/Trinity Server/dep/mysqllite/CMakeFiles/generate.stamp is up-to-date.

CMake does not need to re-run because C:/Trinity Server/dep/bzip2/CMakeFiles/generate.stamp is up-to-date.

CMake does not need to re-run because C:/Trinity Server/dep/zlib/CMakeFiles/generate.stamp is up-to-date.

CMake does not need to re-run because C:/Trinity Server/dep/g3dlite/CMakeFiles/generate.stamp is up-to-date.

CMake does not need to re-run because C:/Trinity Server/dep/gsoap/CMakeFiles/generate.stamp is up-to-date.

CMake does not need to re-run because C:/Trinity Server/src/CMakeFiles/generate.stamp is up-to-date.

CMake does not need to re-run because C:/Trinity Server/src/genrev/CMakeFiles/generate.stamp is up-to-date.

CMake does not need to re-run because C:/Trinity Server/src/server/CMakeFiles/generate.stamp is up-to-date.

CMake does not need to re-run because C:/Trinity Server/src/server/shared/CMakeFiles/generate.stamp is up-to-date.

CMake does not need to re-run because C:/Trinity Server/src/server/game/CMakeFiles/generate.stamp is up-to-date.

CMake does not need to re-run because C:/Trinity Server/src/server/collision/CMakeFiles/generate.stamp is up-to-date.

CMake does not need to re-run because C:/Trinity Server/src/server/authserver/CMakeFiles/generate.stamp is up-to-date.

CMake does not need to re-run because C:/Trinity Server/src/server/scripts/CMakeFiles/generate.stamp is up-to-date.

CMake does not need to re-run because C:/Trinity Server/src/server/worldserver/CMakeFiles/generate.stamp is up-to-date.

CMake does not need to re-run because C:/Trinity Server/sql/CMakeFiles/generate.stamp is up-to-date.

Build log was saved at "file://c:\Trinity Server\ZERO_CHECK.dir\Release\BuildLog.htm"

ZERO_CHECK - 0 error(s), 0 warning(s)

------ Build started: Project: zlib, Configuration: Release Win32 ------

Compiling...

adler32.c

zutil.c

uncompr.c

trees.c

inftrees.c

inflate.c

inffast.c

infback.c

example.c

deflate.c

crc32.c

compress.c

Generating Code...

Creating library...

Build log was saved at "file://c:\Trinity Server\dep\zlib\zlib.dir\Release\BuildLog.htm"

zlib - 0 error(s), 0 warning(s)

------ Build started: Project: libmysql, Configuration: Release Win32 ------

Compiling...

yassl_int.cpp

yassl_imp.cpp

yassl_error.cpp

timer.cpp

ssl.cpp

socket_wrapper.cpp

log.cpp

lock.cpp

handshake.cpp

crypto_wrapper.cpp

cert_wrapper.cpp

buffer.cpp

sha.cpp

rsa.cpp

ripemd.cpp

random.cpp

misc.cpp

md5.cpp

md4.cpp

md2.cpp

integer.cpp

file.cpp

dsa.cpp

dh.cpp

des.cpp

coding.cpp

asn.cpp

arc4.cpp

algebra.cpp

aestables.cpp

aes.cpp

net_serv.cc

Compiling...

hash.cpp

Compiling...

sanity.c

factorial.c

dbug.c

viosslfactories.c

viossl.c

viosocket.c

vio.c

xml.c

strfill.c

strend.c

strcont.c

strcend.c

str_alloc.c

str2int.c

my_vsnprintf.c

my_strtoll10.c

strxnmov.c

strxmov.c

strtoull.c

strtoll.c

strtod.c

strnmov.c

strnlen.c

strmov.c

strmake.c

strinstr.c

longlong2str.c

llstr.c

is_prefix.c

int2str.c

ctype.c

ctype-win1250ch.c

ctype-utf8.c

ctype-ujis.c

ctype-ucs2.c

ctype-uca.c

ctype-tis620.c

ctype-sjis.c

ctype-simple.c

ctype-mb.c

ctype-latin1.c

ctype-gbk.c

ctype-gb2312.c

ctype-extra.c

ctype-eucjpms.c

ctype-euc_kr.c

ctype-czech.c

ctype-cp932.c

ctype-bin.c

ctype-big5.c

bmove_upp.c

bmove.c

bchange.c

password.c

pack.c

my_time.c

client.c

my_sync.c

my_getsystime.c

mf_qsort.c

typelib.c

thr_mutex.c

string.c

sha1.c

safemalloc.c

my_write.c

my_winthread.c

my_wincond.c

my_thr_init.c

my_symlink2.c

my_symlink.c

my_static.c

my_seek.c

my_rename.c

my_realloc.c

my_read.c

my_pthread.c

my_pread.c

my_open.c

my_once.c

my_net.c

my_messnc.c

my_malloc.c

my_lib.c

my_init.c

my_getwd.c

my_getopt.c

my_gethostbyname.c

my_fstream.c

my_fopen.c

my_file.c

my_error.c

my_div.c

my_delete.c

my_create.c

my_compress.c

my_chsize.c

my_alloc.c

my_access.c

mulalloc.c

mf_wcomp.c

mf_unixpath.c

mf_tempfile.c

mf_path.c

mf_pack.c

mf_loadpath.c

mf_iocache2.c

mf_iocache.c

mf_format.c

mf_fn_ext.c

mf_dirname.c

mf_cache.c

mf_arr_appstr.c

list.c

charset.c

charset-def.c

default_modify.c

my_sleep.c

errors.c

default.c

array.c

dll.c

manager.c

libmysql.c

get_password.c

errmsg.c

Compiling...

hash.c

Linking...

   Creating library C:\Trinity Server\dep\mysqllite\Release\libmysql.lib and object C:\Trinity Server\dep\mysqllite\Release\libmysql.exp

my_winthread.obj : error LNK2019: unresolved external symbol _TryEnterCriticalSection referenced in function _win_pthread_mutex_trylock

C:\Trinity Server\bin\Release\libmysql.dll : fatal error LNK1120: 1 unresolved externals

Build log was saved at "file://c:\Trinity Server\dep\mysqllite\libmysql.dir\Release\BuildLog.htm"

libmysql - 2 error(s), 0 warning(s)

========== Build: 2 succeeded, 1 failed, 0 up-to-date, 0 skipped ==========


------ Build started: Project: worldserver, Configuration: Release Win32 ------

Compiling...

worldPCH.cpp

Compiling...

WheatyExceptionReport.cpp

Master.cpp

Main.cpp

WorldRunnable.cpp

TCSoap.cpp

RASocket.cpp

RARunnable.cpp

CliRunnable.cpp

Compiling resources...

fatal error RC1047: too many -I# options, 'C:\OpenSSL-Win32\include\openssl'

Project : error PRJ0002 : Error result 1 returned from 'C:\Program Files\Microsoft Visual Studio 8\VC\bin\rc.exe'.

Build log was saved at "file://c:\Trinity Server\src\server\worldserver\worldserver.dir\Release\BuildLog.htm"

worldserver - 1 error(s), 0 warning(s)


Performing Post-Build Event...

-- Install configuration: "Release"

-- Installing: C:/Program Files/TrinityCore/ace.dll

CMake Error at dep/mysqllite/cmake_install.cmake:39 (FILE):

  file INSTALL cannot find "C:/Trinity Server/bin/Release/libmysql.dll".

Call Stack (most recent call first):

  dep/cmake_install.cmake:33 (INCLUDE)

  cmake_install.cmake:32 (INCLUDE)

Project : error PRJ0019: A tool returned an error code from "Performing Post-Build Event..."

Build log was saved at "file://c:\Trinity Server\INSTALL.dir\Release\BuildLog.htm"

INSTALL - 1 error(s), 0 warning(s)

EDIT: added the rest of the errors from the build

Edited by alysher

Share this post


Link to post
Share on other sites

in my previous thread here i had posted my compile errors from my win2k/vc2005 system. i have solved all but one of them and would like a hand figuring out what i need to do to fix it:

------ Build started: Project: worldserver, Configuration: Release Win32 ------

Compiling...

worldPCH.cpp

Compiling...

WheatyExceptionReport.cpp

Master.cpp

Main.cpp

WorldRunnable.cpp

TCSoap.cpp

RASocket.cpp

RARunnable.cpp

CliRunnable.cpp

Compiling resources...

fatal error RC1047: too many -I# options, 'C:\WINNT'

Project : error PRJ0002 : Error result 1 returned from 'C:\Program Files\Microsoft Visual Studio 8\VC\bin\rc.exe'.

Build log was saved at "file://c:\Trinity Server\src\server\worldserver\worldserver.dir\Release\BuildLog.htm"

worldserver - 1 error(s), 0 warning(s)

Edited by alysher

Share this post


Link to post
Share on other sites

So instead of posting in your current thread you made a new one?

sry....forgot to say that the other thread was too long and i didnt expect any one to wade through it to read my latest error.

Share this post


Link to post
Share on other sites

One of the easiest way how to set up the MySQL database is by

using Apache - PHPMyAdmin i mean... but you don't need to install

all these programs one by one, you can download and install some

"pack" of these...

rly nice pack is XAMPP ( xml - apache - mysql - php ), that you can

get here: http://www.apachefriends.org/en/xampp-windows.html

... so you just install this XAMPP and you don't need to install anything

else, you are ready to work with MySQL databases by using Apache,

programming in PHP by using Apache... XAMPP will make your life easier ;)

Share this post


Link to post
Share on other sites

Windows XP 32bit

TrinityCore: 11191

Hash: e87b6ce8fe42

Visual Studio 2010 Ultimate

.NET Framework 3.5

.NET Framework 4.0

MySQL 5.5

GitExtension version 2.11

Cmake 2.8

OpenSSL

I can't compile the core source, I keep getting this same error no matter what revision i use please help:

Error 1 error MSB4018: The "CustomBuild" task failed unexpectedly.

System.IO.IOException: The process cannot access the file 'C:\Documents and Settings\Thugz69\Local Settings\Temp\0a4fbae1537e4bf3ae0a951862a4e77d.cmd' because it is being used by another process.

at System.IO.__Error.WinIOError(Int32 errorCode, String maybeFullPath)

at System.IO.File.Delete(String path)

at Microsoft.Build.Utilities.ToolTask.Execute()

at Microsoft.Build.CPPTasks.TrackedVCToolTask.Execute()

at Microsoft.Build.BackEnd.TaskExecutionHost.Microsoft.Build.BackEnd.ITaskExecutionHost.Execute()

at Microsoft.Build.BackEnd.TaskBuilder.ExecuteInstantiatedTask(ITaskExecutionHost taskExecutionHost, TaskLoggingContext taskLoggingContext, TaskHost taskHost, ItemBucket bucket, TaskExecutionMode howToExecuteTask, Boolean& taskResult) C:\Program Files\MSBuild\Microsoft.Cpp\v4.0\Microsoft.CppCommon.targets 151 6 scripts

Error 2 error MSB4018: The "CustomBuild" task failed unexpectedly.

System.IO.IOException: The process cannot access the file 'C:\Documents and Settings\Thugz69\Local Settings\Temp\2ead933a4e474e5ebc2a233370e8f00f.cmd' because it is being used by another process.

at System.IO.__Error.WinIOError(Int32 errorCode, String maybeFullPath)

at System.IO.File.Delete(String path)

at Microsoft.Build.Utilities.ToolTask.Execute()

at Microsoft.Build.CPPTasks.TrackedVCToolTask.Execute()

at Microsoft.Build.BackEnd.TaskExecutionHost.Microsoft.Build.BackEnd.ITaskExecutionHost.Execute()

at Microsoft.Build.BackEnd.TaskBuilder.ExecuteInstantiatedTask(ITaskExecutionHost taskExecutionHost, TaskLoggingContext taskLoggingContext, TaskHost taskHost, ItemBucket bucket, TaskExecutionMode howToExecuteTask, Boolean& taskResult) C:\Program Files\MSBuild\Microsoft.Cpp\v4.0\Microsoft.CppCommon.targets 151 6 bzip2

Error 3 error MSB4018: The "CustomBuild" task failed unexpectedly.

System.IO.IOException: The process cannot access the file 'C:\Documents and Settings\Thugz69\Local Settings\Temp\736027348c324df3ac6b780fc9992cb2.cmd' because it is being used by another process.

at System.IO.__Error.WinIOError(Int32 errorCode, String maybeFullPath)

at System.IO.File.Delete(String path)

at Microsoft.Build.Utilities.ToolTask.Execute()

at Microsoft.Build.CPPTasks.TrackedVCToolTask.Execute()

at Microsoft.Build.BackEnd.TaskExecutionHost.Microsoft.Build.BackEnd.ITaskExecutionHost.Execute()

at Microsoft.Build.BackEnd.TaskBuilder.ExecuteInstantiatedTask(ITaskExecutionHost taskExecutionHost, TaskLoggingContext taskLoggingContext, TaskHost taskHost, ItemBucket bucket, TaskExecutionMode howToExecuteTask, Boolean& taskResult) C:\Program Files\MSBuild\Microsoft.Cpp\v4.0\Microsoft.CppCommon.targets 151 6 authserver

Error 4 error LNK1181: cannot open input file '..\scripts\Release\scripts.lib' C:\Destiny\TC\src\server\worldserver\LINK worldserver

and I am Logged on XP with full admin rights.

Share this post


Link to post
Share on other sites

as it says, something else is using those files "another application", perhaps make sure nothing is running in the background or restart the PC and try again to insure they are not being used by something else.

Also, try emptying out your temp folder.

Share this post


Link to post
Share on other sites

I'm struggling right now to figure out how to cross compile to Windows from Linux using the Mingw compiler. When I ran the server in Windows I remember options in the GUI that let me generate Mingw files but as I'm in Linux now (server is headless, so no GUI or even X forwarding) I see no way to generate that kind of project.

Just in case your wondering why I need to compile the Tools and really don't want to spend an entire afternoon loading my old computer with Visual Studio.

Is there a switch that I'm missing, or is this impossible with Linux?

Share this post


Link to post
Share on other sites

first off which version of windows? and yes it will matter in the long run(items compiled for vista and above wont run on 2000 or below....)

Share this post


Link to post
Share on other sites

first off which version of windows? and yes it will matter in the long run(items compiled for vista and above wont run on 2000 or below....)

Aiming for Windows 7. All I need is to run this program once and I'll be finished.

Share this post


Link to post
Share on other sites

Try that: http://forums.codeblocks.org/index.php?topic=3343.0

No GUI, this box is headless :-( . Never installed Gnome, X, or anything else

Share this post


Link to post
Share on other sites

When i hit Configure it gives me this error! :S

i have installed:

Windows 7 32bit

Microsoft Visual Studio 10.0

MySQL 5.5

OpenSSL-Win32

Check for working C compiler using: Visual Studio 10

Check for working C compiler using: Visual Studio 10 -- broken

CMake Error at D:/Program Files/CMake 2.8/share/cmake-2.8/Modules/CMakeTestCCompiler.cmake:52 (MESSAGE):

  The C compiler "cl" is not able to compile a simple test program.


  It fails with the following output:


   Change Dir: D:/Program Files/TrinityBuild/CMakeFiles/CMakeTmp




  Run Build Command:C:\Windows\Microsoft.NET\Framework\v4.0.30319\MSBuild.exe

  cmTryCompileExec.vcxproj /p:Configuration=Debug


  Microsoft (R) Build Engine Version 4.0.30319.1


  [Microsoft .NET Framework, Version 4.0.30319.1]


  Copyright (C) Microsoft Corporation 2007.  All rights reserved.




  Build started 16-2-2011 14:46:07.


  Project "D:\Program

  Files\TrinityBuild\CMakeFiles\CMakeTmp\cmTryCompileExec.vcxproj" on node 1

  (default targets).


  InitializeBuildStatus:


    Creating "cmTryCompileExec.dir\Debug\cmTryCompileExec.unsuccessfulbuild" because "AlwaysCreate" was specified.


  ClCompile:


    C:\Program Files\Microsoft Visual Studio 10.0\VC\bin\CL.exe /c /Zi /nologo- /W3 /WX- /Od /Ob0 /Oy- /D WIN32 /D _WINDOWS /D _DEBUG /D "CMAKE_INTDIR=\"Debug\"" /D _MBCS /Gm- /RTC1 /MDd /GS /fp:precise /Zc:wchar_t /Zc:forScope /Fo"cmTryCompileExec.dir\Debug\\" /Fd"D:/Program Files/TrinityBuild/CMakeFiles/CMakeTmp/Debug/cmTryCompileExec.pdb" /Gd /TC /analyze- /errorReport:queue testCCompiler.c  /Zm1000 

    Microsoft (R) 32-bit C/C++ Optimizing Compiler Version 16.00.30319.01 for 80x86

    Copyright (C) Microsoft Corporation.  All rights reserved.


    cl /c /Zi /nologo- /W3 /WX- /Od /Ob0 /Oy- /D WIN32 /D _WINDOWS /D _DEBUG /D "CMAKE_INTDIR=\"Debug\"" /D _MBCS /Gm- /RTC1 /MDd /GS /fp:precise /Zc:wchar_t /Zc:forScope /Fo"cmTryCompileExec.dir\Debug\\" /Fd"D:/Program Files/TrinityBuild/CMakeFiles/CMakeTmp/Debug/cmTryCompileExec.pdb" /Gd /TC /analyze- /errorReport:queue testCCompiler.c  /Zm1000 


  cl : Command line warning D9035: option 'nologo-' has been deprecated and

  will be removed in a future release [D:\Program

  Files\TrinityBuild\CMakeFiles\CMakeTmp\cmTryCompileExec.vcxproj]


    testCCompiler.c



  testCCompiler.c : fatal error C1033: cannot open program database ''

  [D:\Program

  Files\TrinityBuild\CMakeFiles\CMakeTmp\cmTryCompileExec.vcxproj]


  Done Building Project "D:\Program

  Files\TrinityBuild\CMakeFiles\CMakeTmp\cmTryCompileExec.vcxproj" (default

  targets) -- FAILED.




  Build FAILED.




  "D:\Program

  Files\TrinityBuild\CMakeFiles\CMakeTmp\cmTryCompileExec.vcxproj" (default

  target) (1) ->


  (ClCompile target) -> 


    cl : Command line warning D9035: option 'nologo-' has been deprecated and will be removed in a future release [D:\Program Files\TrinityBuild\CMakeFiles\CMakeTmp\cmTryCompileExec.vcxproj]






  "D:\Program

  Files\TrinityBuild\CMakeFiles\CMakeTmp\cmTryCompileExec.vcxproj" (default

  target) (1) ->


  (ClCompile target) -> 


    testCCompiler.c : fatal error C1033: cannot open program database '' [D:\Program Files\TrinityBuild\CMakeFiles\CMakeTmp\cmTryCompileExec.vcxproj]




      1 Warning(s)

      1 Error(s)




  Time Elapsed 00:00:01.05






  CMake will not be able to correctly generate this project.

Call Stack (most recent call first):

  CMakeLists.txt:12 (project)



Configuring incomplete, errors occurred!

Share this post


Link to post
Share on other sites

I get the same error for worldserver. I used to compile fine a year ago. Ill try to compile with VC10

WinXP, VC 2008 express

18>CliRunnable.cpp

18>Compiling resources...

18>fatal error RC1047: too many -I# options, 'D:\Programs\OpenSSL-Win32\include'

18>Project : error PRJ0002 : Error result 1 returned from 'C:\Program Files\Microsoft Platform SDK for Windows Server 2003 R2\Bin\rc.exe'.

18>Build log was saved at "file://d:\Jeux\Mangos\Source\Workbench\src\server\worldserver\worldserver.dir\Release\BuildLog.htm"

18>worldserver - 1 error(s), 0 warning(s)

19>------ Skipped Build: Project: INSTALL, Configuration: Release Win32 ------

19>Project not selected to build for this solution configuration 

========== Build: 17 succeeded, 1 failed, 1 up-to-date, 1 skipped ==========

Share this post


Link to post
Share on other sites

Join the conversation

You can post now and register later. If you have an account, sign in now to post with your account.

Guest
Reply to this topic...

×   Pasted as rich text.   Paste as plain text instead

  Only 75 emoji are allowed.

×   Your link has been automatically embedded.   Display as a link instead

×   Your previous content has been restored.   Clear editor

×   You cannot paste images directly. Upload or insert images from URL.


  • Recently Browsing   0 members

    No registered users viewing this page.

  • Similar Content

    • By 939h
      Hi,

      The chat channel Lookup for group is not available when a player isn't in a city. I tried to modify the worldserver.conf file with:
      #
      #    Channel.RestrictedLfg
      #        Description: Restrict LookupForGroup channel to characters registered in the LFG tool.
      #        Default:     1 - (Enabled, Allow join to channel only if registered in LFG)
      #                     0 - (Disabled, Allow join to channel in any time)
      Channel.RestrictedLfg = 0

      I restarted the server but it didn't help.

      Thanks
    • By meeek
      Hey, I've been trying to compile from github the core from 6.2.3/6.2.4, I'm well aware its stopped developing. I cannot get it to configure properly in CMake, nor can I obviously build it.
       
      I'd be willing to pay for help and get this working and running. I want to develop my own server on my freetime as a learning project and for entertainment. I can't find any core for WoD, sadly.. Very hard, would appreciate any quick help
       
    • By Probie_Wan_Kenobi
      I believe everything I have done up to this point has been correct. When I go to launch worldserver.exe a console window opens up for a second and closes right away and nothing else seems to have happened. I skipped a head a little in the instructions to see what is left and step 5 seems skippable since I am running this only for this computer and step 6 has me launch to a log in screen which I can not get to. I tried going to the faq but the page was not loading properly so I am forced to post here.
    • By Wark
      I'd just like to get a little insight to why so much of the current Trinitycore code doesn't match up to a few years ago.
      Now I know I'm not a pro at coding on Trinitycore and I understand that the core is open sourced but these just seem so significant and doesn't seem right to remove this stuff.
       
      Let me give an example. Lets say I'm watching this tutorial to get a little information about classes and methods that I can use when making a script. (I've also been using the Trinitycore Code Documentation as reference as well but it also seems to show the same issues)
      Although the tutorial is a little out of date, I don't see why OnGossipSelect doesn't exist anywhere in CreatureScript and that when I try to link the script to the core code it spits out this error.
      object of abstract class type "GossipTeleporter" is not allowed:
      pure virtual function "CreatureScript::GetAI" has no overrider
      The DEFINES of "ADD_GOSSIP_ITEM" and many more don't exist either.
       
      Am I missing something? All I want to know is if the core is mean't to be this way and if not should I download an older version of the core before I put to much working into my current core.
      (I downloaded my core right from the Trinitycore website tutorial)
       
      I'm currently trying to write a simple gossipteleporter that will let you talk to an npc and teleport to the given location. It's very hard to do this when so many things just don't exist within my core.
       
      EXTRA: I pasted this into a new custom script just to see if I would get errors and I got a lot of different errors: http://pastebin.com/raw/G62e0t49
      This was obtained from here: http://www.ac-web.org/forums/showthread.php?129885-Request-Teleporter-NPC-for-TrinityCore
      By no means am I looking to copy the code from the two links above, I was using them as a test to see if my core accepted them.
       
      Thanks,
      Wark
    • By Cantte
      Well ... today I was about to compile the trinity core version for WoW 4.3.4 of this repository "https://gitlab.com/trinitycore/TrinityCore_434". Download them and when you use the cmake, I generate the solution correctly. When I began to compile this went well until I got to the last step, when I was 90% practically.
      This was the error:
      Main.obj: error LNK2019: external symbol SSLeay_version unresolved referred to in the function "public: void __cdecl <lambda_4a2d53ce610f18dba0b4b4d6532c13a7> :: operator () (void) const" (?? R <lambda_4a2d53ce610f18dba0b4b4d6532c13a7> @@ QEBAXXZ)
      25> scripts.lib (cs_server.obj): error LNK2001: external symbol SSLeay_version unresolved
      25> gsoap.lib (stdsoap2.obj): error LNK2019: unresolved sk_num external symbol referenced in the tcp_connect function
      25> gsoap.lib (stdsoap2.obj): error LNK2019: unresolved sk_value external symbol referenced in the tcp_connect function
      25> gsoap.lib (stdsoap2.obj): error LNK2019: unresolved sk_pop_free external symbol referenced in the tcp_connect function
      25> gsoap.lib (stdsoap2.obj): error LNK2019: outer symbol OPENSSL_add_all_algorithms_noconf unresolved referenced in the soap_ssl_init function
      25> gsoap.lib (stdsoap2.obj): error LNK2019: external symbol SSL_load_error_strings unresolved referenced in the soap_ssl_init function
      25> gsoap.lib (stdsoap2.obj): error LNK2019: unresolved external SSLv23_method symbol referenced in the ssl_auth_init function
      25> gsoap.lib (stdsoap2.obj): error LNK2019: external symbol SSL_library_init unresolved referenced in the soap_ssl_init function
      25> gsoap.lib (stdsoap2.obj): error LNK2019: external symbol SSL_state unresolved referenced in the tcp_connect function
      25> common.lib (OpenSSLCrypto.obj): error LNK2019: external symbol CRYPTO_num_locks unresolved referred to in the function "void __cdecl OpenSSLCrypto :: threadsCleanup (void)" (? ThreadsCleanup @ OpenSSLCrypto @@ YAXXZ)
      25> common.lib (OpenSSLCrypto.obj): error LNK2019: external symbol CRYPTO_set_locking_callback unresolved referred to in the function "void __cdecl OpenSSLCrypto :: threadsCleanup (void)" (? ThreadsCleanup @ OpenSSLCrypto @@ YAXXZ)
      25> common.lib (OpenSSLCrypto.obj): error LNK2019: external symbol CRYPTO_THREADID_set_numeric unresolved referred to in the function "void __cdecl threadIdCallback (struct crypto_threadid_st *)" (? ThreadIdCallback @@ YAXPEAUcrypto_threadid_st @@@ Z)
      25> common.lib (OpenSSLCrypto.obj): error LNK2019: external symbol CRYPTO_THREADID_set_callback unresolved referenced in the function "void __cdecl OpenSSLCrypto :: threadsCleanup (void)" (? ThreadsCleanup @ OpenSSLCrypto @@ YAXXZ)
      25> common.lib (ARC4.obj): error LNK2019: external symbol EVP_CIPHER_CTX_init unresolved referred to in the function "public: __cdecl ARC4 :: ARC4 (unsigned int)" (?? 0ARC4 @@ QEAA @ I @ Z)
      25> common.lib (HmacHash.obj): error LNK2019: unresolved HMAC_CTX_init external symbol referenced in the "struct hmac_ctx_st * __cdecl HMAC_CTX_new (void)" function (? HMAC_CTX_new @@ YAPEAUhmac_ctx_st @@ XZ)
      25> common.lib (HmacHash.obj): error LNK2019: unresolved HMAC_CTX_cleanup external symbol referenced in the "void __cdecl HMAC_CTX_free (struct hmac_ctx_st *)" function (? HMAC_CTX_free @@ YAXPEAUhmac_ctx_st @@@ Z)
      25> E: \ Server-Wow \ TrinityCore_434-4.3.4 \ Build \ bin \ RelWithDebInfo \ worldserver.exe: fatal error LNK1120: 16 external unresolved
      25> Compilation of the "worldserver.vcxproj" project completed - ERROR.
      26> ------ Compile operation started: project: ALL_BUILD, configuration: RelWithDebInfo x64 ------
      26> Building Custom Rule E: /Server-Wow/TrinityCore_434-4.3.4/CMakeLists.txt
      26> CMake does not need to re-run because E: /Server-Wow/TrinityCore_434-4.3.4/Build/CMakeFiles/generate.stamp is up-to-date.
      ========== Compile: 23 correct, 3 incorrect, 0 updated, 0 omitted ==========
       
      And this is the original error in Spanish (since I use the compiler in Spanish)
       
      Main.obj : error LNK2019: símbolo externo SSLeay_version sin resolver al que se hace referencia en la función "public: void __cdecl <lambda_4a2d53ce610f18dba0b4b4d6532c13a7>::operator()(void)const " (??R<lambda_4a2d53ce610f18dba0b4b4d6532c13a7>@@QEBAXXZ)
      25>scripts.lib(cs_server.obj) : error LNK2001: símbolo externo SSLeay_version sin resolver
      25>gsoap.lib(stdsoap2.obj) : error LNK2019: símbolo externo sk_num sin resolver al que se hace referencia en la función tcp_connect
      25>gsoap.lib(stdsoap2.obj) : error LNK2019: símbolo externo sk_value sin resolver al que se hace referencia en la función tcp_connect
      25>gsoap.lib(stdsoap2.obj) : error LNK2019: símbolo externo sk_pop_free sin resolver al que se hace referencia en la función tcp_connect
      25>gsoap.lib(stdsoap2.obj) : error LNK2019: símbolo externo OPENSSL_add_all_algorithms_noconf sin resolver al que se hace referencia en la función soap_ssl_init
      25>gsoap.lib(stdsoap2.obj) : error LNK2019: símbolo externo SSL_load_error_strings sin resolver al que se hace referencia en la función soap_ssl_init
      25>gsoap.lib(stdsoap2.obj) : error LNK2019: símbolo externo SSLv23_method sin resolver al que se hace referencia en la función ssl_auth_init
      25>gsoap.lib(stdsoap2.obj) : error LNK2019: símbolo externo SSL_library_init sin resolver al que se hace referencia en la función soap_ssl_init
      25>gsoap.lib(stdsoap2.obj) : error LNK2019: símbolo externo SSL_state sin resolver al que se hace referencia en la función tcp_connect
      25>common.lib(OpenSSLCrypto.obj) : error LNK2019: símbolo externo CRYPTO_num_locks sin resolver al que se hace referencia en la función "void __cdecl OpenSSLCrypto::threadsCleanup(void)" ([email protected]@@YAXXZ)
      25>common.lib(OpenSSLCrypto.obj) : error LNK2019: símbolo externo CRYPTO_set_locking_callback sin resolver al que se hace referencia en la función "void __cdecl OpenSSLCrypto::threadsCleanup(void)" ([email protected]@@YAXXZ)
      25>common.lib(OpenSSLCrypto.obj) : error LNK2019: símbolo externo CRYPTO_THREADID_set_numeric sin resolver al que se hace referencia en la función "void __cdecl threadIdCallback(struct crypto_threadid_st *)" ([email protected]@[email protected]@@Z)
      25>common.lib(OpenSSLCrypto.obj) : error LNK2019: símbolo externo CRYPTO_THREADID_set_callback sin resolver al que se hace referencia en la función "void __cdecl OpenSSLCrypto::threadsCleanup(void)" ([email protected]@@YAXXZ)
      25>common.lib(ARC4.obj) : error LNK2019: símbolo externo EVP_CIPHER_CTX_init sin resolver al que se hace referencia en la función "public: __cdecl ARC4::ARC4(unsigned int)" ([email protected]@[email protected]@Z)
      25>common.lib(HmacHash.obj) : error LNK2019: símbolo externo HMAC_CTX_init sin resolver al que se hace referencia en la función "struct hmac_ctx_st * __cdecl HMAC_CTX_new(void)" ([email protected]@[email protected]@XZ)
      25>common.lib(HmacHash.obj) : error LNK2019: símbolo externo HMAC_CTX_cleanup sin resolver al que se hace referencia en la función "void __cdecl HMAC_CTX_free(struct hmac_ctx_st *)" ([email protected]@[email protected]@@Z)
      25>E:\Server-Wow\TrinityCore_434-4.3.4\Build\bin\RelWithDebInfo\worldserver.exe : fatal error LNK1120: 16 externos sin resolver
      25>Compilación del proyecto "worldserver.vcxproj" terminada -- ERROR.
      26>------ Operación Compilar iniciada: proyecto: ALL_BUILD, configuración: RelWithDebInfo x64 ------
      26>Building Custom Rule E:/Server-Wow/TrinityCore_434-4.3.4/CMakeLists.txt
      26>CMake does not need to re-run because E:/Server-Wow/TrinityCore_434-4.3.4/Build/CMakeFiles/generate.stamp is up-to-date.
      ========== Compilar: 23 correctos, 3 incorrectos, 0 actualizados, 0 omitidos ==========
       
       
      Thanks.
×
×
  • Create New...