Jump to content
TrinityCore

Spooky

Plebs
  • Content Count

    2
  • Joined

  • Last visited

Community Reputation

0 Neutral

About Spooky

  • Rank
    Newbie
  1. clang: error: unable to execute command: Killed clang: error: clang frontend command failed due to signal (use -v to see invocation) clang version 3.8.1-24 (tags/RELEASE_381/final) Target: x86_64-pc-linux-gnu Thread model: posix InstalledDir: /usr/bin clang: note: diagnostic msg: PLEASE submit a bug report to http://llvm.org/bugs/ and include the crash backtrace, preprocessed source, and associated run script. clang: note: diagnostic msg: ******************** PLEASE ATTACH THE FOLLOWING FILES TO THE BUG REPORT: Preprocessed source(s) and associated run script(s) are located at: clang: note: diagnostic msg: /tmp/AchievementMgr-5536b9.cpp clang: note: diagnostic msg: /tmp/AchievementMgr-5536b9.sh clang: note: diagnostic msg: ******************** src/server/game/CMakeFiles/game.dir/build.make:627: recipe for target 'src/server/game/CMakeFiles/game.dir/Achievements/AchievementMgr.cpp.o' failed make[2]: *** [src/server/game/CMakeFiles/game.dir/Achievements/AchievementMgr.cpp.o] Error 254 CMakeFiles/Makefile2:1279: recipe for target 'src/server/game/CMakeFiles/game.dir/all' failed make[1]: *** [src/server/game/CMakeFiles/game.dir/all] Error 2 Makefile:127: recipe for target 'all' failed make: *** [all] Error 2
  2. При построении исходного кода выдает это : Как исправить? Debian 9 clang: error: unable to execute command: Killed clang: error: clang frontend command failed due to signal (use -v to see invocation) clang version 3.8.1-24 (tags/RELEASE_381/final) Target: x86_64-pc-linux-gnu Thread model: posix InstalledDir: /usr/bin clang: note: diagnostic msg: PLEASE submit a bug report to http://llvm.org/bugs/ and include the crash backtrace, preprocessed source, and associated run script. clang: note: diagnostic msg: ******************** PLEASE ATTACH THE FOLLOWING FILES TO THE BUG REPORT: Preprocessed source(s) and associated run script(s) are located at: clang: note: diagnostic msg: /tmp/AchievementMgr-5536b9.cpp clang: note: diagnostic msg: /tmp/AchievementMgr-5536b9.sh clang: note: diagnostic msg: ******************** src/server/game/CMakeFiles/game.dir/build.make:627: recipe for target 'src/server/game/CMakeFiles/game.dir/Achievements/AchievementMgr.cpp.o' failed make[2]: *** [src/server/game/CMakeFiles/game.dir/Achievements/AchievementMgr.cpp.o] Error 254 CMakeFiles/Makefile2:1279: recipe for target 'src/server/game/CMakeFiles/game.dir/all' failed make[1]: *** [src/server/game/CMakeFiles/game.dir/all] Error 2 Makefile:127: recipe for target 'all' failed make: *** [all] Error 2
×
×
  • Create New...