Jump to content
TrinityCore

Dekadence

Members
  • Posts

    15
  • Joined

  • Last visited

Everything posted by Dekadence

  1. The problem still with Debian 7.1 (all updated), original repositories, original kernel, x64 bits. @Aokromes: You can test with x64? Greetings
  2. Thanks for the information, to close restarter use (in console): kill (pid) show pid (is show before screen name): screen -list[/code] or use: [code]screen -r world ctrl+c[/code] A greeting and a lot of thanks
  3. I have problems compiling TrinityCore in progress 33% of the compilation stops with the following error [ 33%] Building CXX object src/server/collision/CMakeFiles/collision.dir/Maps/TileAssembler.cpp.o /root/TrinityCore/src/server/collision/Maps/TileAssembler.cpp: In member function 'bool VMAP::TileAssembler::calculateTransformedBound(VMAP::ModelSpawn&)': /root/TrinityCore/src/server/collision/Maps/TileAssembler.cpp:348: error interno del compilador: Violaci&#243;n de segmento Por favor env&#237;e un reporte completo de bichos, con el c&#243;digo preprocesado si es apropiado. Vea <URL:http://bugzilla.redhat.com/bugzilla> para m&#225;s instrucciones. Preprocessed source stored into /tmp/ccmI6ntn.out file, please attach this to your bugreport. make[2]: *** [src/server/collision/CMakeFiles/collision.dir/Maps/TileAssembler.cpp.o] Error 1 make[1]: *** [src/server/collision/CMakeFiles/collision.dir/all] Error 2 make: *** [all] Error 2 Thanks in advance and best regards
×
×
  • Create New...