Jump to content
TrinityCore

amsjunior

Plebs
  • Content Count

    7
  • Joined

  • Last visited

Community Reputation

0 Neutral

About amsjunior

  • Rank
    Newbie
  1. /opt/trinity/compilar# cmake ../TrinityCore/ -DPREFIX=/opt/trinity/compi_xx1 -- The C compiler identification is GNU -- The CXX compiler identification is GNU -- Check for working C compiler: /usr/bin/gcc -- Check for working C compiler: /usr/bin/gcc -- works -- Detecting C compiler ABI info -- Detecting C compiler ABI info - done -- Check for working CXX compiler: /usr/bin/c++ -- Check for working CXX compiler: /usr/bin/c++ -- works -- Detecting CXX compiler ABI info -- Detecting CXX compiler ABI info - done -- Detected 64-bit platform -- UNIX: Using jemalloc -- UNIX: Using default configuration directory -- UNIX: Using default library directory -- UNIX: Configuring uninstall target -- UNIX: Created uninstall target -- GCC: SFMT enabled, SSE2 flags forced -- Found ACE library: /usr/local/lib/libACE.so -- Found ACE headers: /usr/local/include -- Found OpenSSL: /usr/lib/libssl.so;/usr/lib/libcrypto.so -- Using mysql-config: /usr/bin/mysql_config -- Found MySQL library: /usr/lib/libmysqlclient_r.so -- Found MySQL headers: /usr/include/mysql -- Found Readline library: /usr/lib/libreadline.so -- Include dir is: /usr/include -- Found ZLIB: /usr/include -- Found BZip2: /usr/lib/libbz2.so -- Looking for BZ2_bzCompressInit in /usr/lib/libbz2.so -- Looking for BZ2_bzCompressInit in /usr/lib/libbz2.so - found * TrinityCore rev. hash : 17400a9c3a56 * TrinityCore rev. date : 2013-01-25 15:29:31 -0200 * TrinityCore buildtype : Release * Install core to : /opt/trinity/compi_xx1 * Install libraries to : /opt/trinity/compi_xx1/lib * Install configs to : /opt/trinity/compi_xx1/etc * Build world/auth : Yes (default) * Build with scripts : Yes (default) * Build map/vmap tools : No (default) * Build core w/PCH : Yes (default) * Build scripts w/PCH : Yes (default) * Show compile-warnings : No (default) * Use coreside debug : No (default) -- SCRIPT PREPARATIONS -> Prepared: Spells -> Prepared: Commands -> Prepared: Examples -> Prepared: Custom -> Prepared: World -> Prepared: Outdoor PVP Zones -> Prepared: Eastern Kingdoms -> Prepared: Kalimdor -> Prepared: Outland -> Prepared: Northrend -> Prepared: Events -- SCRIPT PREPARATION COMPLETE -- Configuring done -- Generating done -- Build files have been written to: /opt/trinity/compilar /opt/trinity/compilar# compila 100% when I try to start the segment falt
  2. after comit Core/DBLayer: Drop support for MySQL versions <5.1 my worldserver not starting instaled on custom folder ACE 5.7.8 openssl-0.9.8o cmake used before cmake ../TrinityCore/ -DPREFIX=/opt/trinity/compi_035 -DACE_LIBRARY=/opt/trinity/.sys/lib/libACE.so -DACE_INCLUDE_DIR=/opt/trinity/.sys/include/ -DSSLLIB=/opt/trinity/.sys/lib/libssl.so -DMYSQL_LIBRARIES_crypto=/opt/trinity/.sys/lib/libcrypto.so -DWITH_COREDEBUG=0 compile ok and starting 100% but after this comit on top my worldserver not starting
  3. I upgrade to ACE-6.0.1.tar.gz , and openssl-1.0.0d.tar.gz never had problems in compiling. but yesterday after trying to compile the new patches I had this error. Today I tried to update the ACE and OPENSSL but still giving the same error
  4. [ 33%] Building CXX object src/server/authserver/CMakeFiles/authserver.dir/Main.cpp.o Linking CXX executable authserver ../shared/libshared.a(Threading.cpp.o): In function `ACE_TSS<ACE_Based::Thread>::ts_init()': Threading.cpp:(.text._ZN7ACE_TSSIN9ACE_Based6ThreadEE7ts_initEv[ACE_TSS<ACE_Based::Thread>::ts_init()]+0x5a): undefined reference to `ACE_OS::thr_keycreate(unsigned int*, void (*)(void*))' ../shared/libshared.a(Threading.cpp.o): In function `ACE_TSS<ACE_Based::Thread>::ACE_TSS(ACE_Based::Thread*)': Threading.cpp:(.text._ZN7ACE_TSSIN9ACE_Based6ThreadEEC1EPS1_[ACE_TSS<ACE_Based::Thread>::ACE_TSS(ACE_Based::Thread*)]+0xd2): undefined reference to `ACE_OS::thr_keycreate(unsigned int*, void (*)(void*))' ../shared/libshared.a(Threading.cpp.o): In function `ACE_TSS<ACE_Based::Thread>::~ACE_TSS()': Threading.cpp:(.text._ZN7ACE_TSSIN9ACE_Based6ThreadEED0Ev[ACE_TSS<ACE_Based::Thread>::~ACE_TSS()]+0x7a): undefined reference to `ACE_OS::thr_key_detach(unsigned int)' ../shared/libshared.a(Threading.cpp.o): In function `ACE_TSS<ACE_Based::Thread>::~ACE_TSS()': Threading.cpp:(.text._ZN7ACE_TSSIN9ACE_Based6ThreadEED1Ev[ACE_TSS<ACE_Based::Thread>::~ACE_TSS()]+0x7a): undefined reference to `ACE_OS::thr_key_detach(unsigned int)' ../shared/libshared.a(Util.cpp.o): In function `ACE_TSS<MTRand>::ts_init()': Util.cpp:(.text._ZN7ACE_TSSI6MTRandE7ts_initEv[ACE_TSS<MTRand>::ts_init()]+0x5a): undefined reference to `ACE_OS::thr_keycreate(unsigned int*, void (*)(void*))' ../shared/libshared.a(Util.cpp.o): In function `ACE_TSS<MTRand>::ACE_TSS(MTRand*)': Util.cpp:(.text._ZN7ACE_TSSI6MTRandEC1EPS0_[ACE_TSS<MTRand>::ACE_TSS(MTRand*)]+0xd2): undefined reference to `ACE_OS::thr_keycreate(unsigned int*, void (*)(void*))' ../shared/libshared.a(Util.cpp.o): In function `ACE_TSS<MTRand>::~ACE_TSS()': Util.cpp:(.text._ZN7ACE_TSSI6MTRandED0Ev[ACE_TSS<MTRand>::~ACE_TSS()]+0x4f): undefined reference to `ACE_OS::thr_key_detach(unsigned int)' ../shared/libshared.a(Util.cpp.o): In function `ACE_TSS<MTRand>::~ACE_TSS()': Util.cpp:(.text._ZN7ACE_TSSI6MTRandED1Ev[ACE_TSS<MTRand>::~ACE_TSS()]+0x4f): undefined reference to `ACE_OS::thr_key_detach(unsigned int)' collect2: ld returned 1 exit status make[2]: *** [src/server/authserver/authserver] Error 1 make[1]: *** [src/server/authserver/CMakeFiles/authserver.dir/all] Error 2 make: *** [all] Error 2 vistawow3:/opt/trinity/compilar# please help
×
×
  • Create New...