Jump to content
TrinityCore

AlfieO

Plebs
  • Posts

    6
  • Joined

  • Last visited

AlfieO's Achievements

Newbie

Newbie (1/14)

0

Reputation

  1. I copied the files from openSSL 32 folder and it works but this time my problem is when I patch the wow.exe it gives me an error saying unable to find pattern. Can you help please.
  2. I successfully created 32 bit connection_patcher.exe but i have this problem now libeay32.dll is missing and when I downloaded it at dlldll.com it says now - The ordinal 3479 could not be located in the dynamic link library LIBEAY32.dll
  3. Hi, I have created a connection_patcher in windows for 64 but when I build connection patcher for 32 bit it always crashes saying on my 2013 express VS with bunch of mysql errors. Can you anyone help me with this or share your 32 bit connection_patcher? I've been working on making a patcher for this.
  4. /usr/local/include/boost/utility/result_of.hpp:189:8: error: no class template named ‘result’ in ‘const struct TaxiPathGraph::GetCompleteNodeRoute(const TaxiNodesEntry*, const TaxiNodesEntry*, const Player*, std::vector<unsigned int>&)::<lambda(const struct TaxiPathGraph::EdgeCost&)>’ compilation terminated due to -Wfatal-errors. make[2]: *** [src/server/game/CMakeFiles/game.dir/Entities/Taxi/TaxiPathGraph.cpp.o] Error 1 make[1]: *** [src/server/game/CMakeFiles/game.dir/all] Error 2 make: *** [all] Error 2
  5. I need help in the compilation area, I am not able to proceed it keeps on throwing me errors, even though I thoroughly followed guide. Please help.
×
×
  • Create New...