Jump to content
TrinityCore

Mangosbot/Playerbot compile errors - Debian 8.5


skeezix
 Share

Recommended Posts

Hello -

Does anyone mess with this particular flavor? I installed a new Debian 8.5 server, nothing but the basics. I installed the needed packages, setup a git clone for brand trinity-wotlk-ai (3.3.5), and tried to compile. I can compile this on Windows, but not linux. I can, though, compile the normal trinity build. I tried this a few days ago but not sure which commit/build as I deleted it once I knew I could at least compile it. (sorry!)

I didn't really look through the build logs on Windows since it compiled fine, but I assume the issues below are existent there as well, but just don't stop it from finishing. In linux, I'll see warnings from compiling some of it, but then it gets all the way to 100% progress then dumps the whole thing.

Here's the output of cmake - http://pastebin.com/c96LMDBE

Here's the output of make (errors/warnings only) - http://pastebin.com/tUH1L0bn

This server is a virtual machine, 22 cores and 32GB memory. The commit I'm grabbing for mangosbot is 9fefd30dabd9d5e8be82651e288feeb9b5025c22 and I also tried the previous, which is 55b583d1726fe70d55c4b9efab476d3fa0710ae4 and got the same errors.

The directions for mangosbot were to clone whatever branch you want for it, then follow the same directions for compiling/installing TrinityCore. I went through these step-by-step and cannot find anything else I could do. Anyone have any ideas? I'm with limited coding knowledge.

Note - I also tried Ubuntu 16.04, as well as Fedora (23 I think? whatever is the latest at this point) and got the same compile errors on those as well.

Thanks!

Link to comment
Share on other sites

Join the conversation

You can post now and register later. If you have an account, sign in now to post with your account.

Guest
Reply to this topic...

×   Pasted as rich text.   Paste as plain text instead

  Only 75 emoji are allowed.

×   Your link has been automatically embedded.   Display as a link instead

×   Your previous content has been restored.   Clear editor

×   You cannot paste images directly. Upload or insert images from URL.

 Share

  • Recently Browsing   0 members

    No registered users viewing this page.

  • Similar Content

    • By Sandra Kaimraptor
      Dear Community,
      currently I am using screen to manage the daily restart of that server to prevent overloads. But screen is not a clean solution for that. I want to integrate the worldserver and authserver as services to my system. Unfortunately I do not know how I can write into the running daemon any command via Bash shell? sighup shutdown via killall is no option because I need to shutdown the server with 5 minutes delay and informing all players about the shutdown.
      Has anyone any idea how to resolve that issue?
      Kind Regards
      Sandra Kaimraptor
    • By blackmetalz
      Hi guys, I'm going to buy new hardware for reducing compile time in Trinity core. I have heard about Ryzen, it had more core and threads but haven't tested its performance. I just want to ask anyone have Ryzen CPU can share compile time?
       
    • By Atréalis
      When taking quests, NPC text is in French (witch is what I want) but when checking or completing, text become in English.
      screens: quest proposal - quest validation
      Does anyone have a clue how to change it to French only? (and what in the world have I done for it to be like this?)
      Thanks.
    • By zsemi02
      hi. i want to compile the core in Microsoft Visual Studio 2013, but i get rhis error:

      Warning    1    warning C4805: '==' : unsafe mix of type 'bool' and type 'uint16' in operation    C:\test\source\source\src\server\game\Entities\Unit\Unit.cpp    15688    1    game Error    2    error C2903: 'result' : symbol is neither a class template nor a function template (C:\test\source\source\src\server\game\Entities\Taxi\TaxiPathGraph.cpp)    C:\local\boost_1_55_0\boost\utility\result_of.hpp    186    1    game Error    3    error C2039: 'result' : is not a member of 'TaxiPathGraph::GetCompleteNodeRoute::<lambda_b66f1e4d2625bde789c6e1f8e8bffd24>' (C:\test\source\source\src\server\game\Entities\Taxi\TaxiPathGraph.cpp)    C:\local\boost_1_55_0\boost\utility\result_of.hpp    186    1    game Error    4    error C2504: 'result' : base class undefined (C:\test\source\source\src\server\game\Entities\Taxi\TaxiPathGraph.cpp)    C:\local\boost_1_55_0\boost\utility\result_of.hpp    186    1    game Error    5    error C2143: syntax error : missing ',' before '<' (C:\test\source\source\src\server\game\Entities\Taxi\TaxiPathGraph.cpp)    C:\local\boost_1_55_0\boost\utility\result_of.hpp    186    1    game Error    6    error C2783: 'boost::transform_value_property_map<Func,PM,Ret> boost::make_transform_value_property_map(const Func &,const PM &)' : could not deduce template argument for 'Ret'    C:\test\source\source\src\server\game\Entities\Taxi\TaxiPathGraph.cpp    156    1    game Error    7    error C2893: Failed to specialize function template 'boost::transform_value_property_map<Func,PM,boost::result_of<const Func(property_traits<PA>::reference)>::type> boost::make_transform_value_property_map(const Func &,const PM &)'    C:\test\source\source\src\server\game\Entities\Taxi\TaxiPathGraph.cpp    156    1    game Error    8    error C2780: 'void boost::dijkstra_shortest_paths(const VertexListGraph &,graph_traits<G>::vertex_descriptor,const boost::bgl_named_params<T,Tag,Base> &)' : expects 3 arguments - 2 provided    C:\test\source\source\src\server\game\Entities\Taxi\TaxiPathGraph.cpp    156    1    game Error    9    error C2780: 'void boost::dijkstra_shortest_paths(const VertexListGraph &,graph_traits<G>::vertex_descriptor,PredecessorMap,DistanceMap,WeightMap,IndexMap,Compare,Combine,DistInf,DistZero,DijkstraVisitor)' : expects 11 arguments - 2 provided    C:\test\source\source\src\server\game\Entities\Taxi\TaxiPathGraph.cpp    156    1    game Error    10    error C2780: 'void boost::dijkstra_shortest_paths(const VertexListGraph &,SourceInputIter,SourceInputIter,PredecessorMap,DistanceMap,WeightMap,IndexMap,Compare,Combine,DistInf,DistZero,DijkstraVisitor)' : expects 12 arguments - 2 provided    C:\test\source\source\src\server\game\Entities\Taxi\TaxiPathGraph.cpp    156    1    game Error    11    error C2780: 'void boost::dijkstra_shortest_paths(const VertexListGraph &,graph_traits<G>::vertex_descriptor,PredecessorMap,DistanceMap,WeightMap,IndexMap,Compare,Combine,DistInf,DistZero,DijkstraVisitor,ColorMap)' : expects 12 arguments - 2 provided    C:\test\source\source\src\server\game\Entities\Taxi\TaxiPathGraph.cpp    156    1    game Error    12    error C2780: 'void boost::dijkstra_shortest_paths(const VertexListGraph &,SourceInputIter,SourceInputIter,PredecessorMap,DistanceMap,WeightMap,IndexMap,Compare,Combine,DistInf,DistZero,DijkstraVisitor,ColorMap)' : expects 13 arguments - 2 provided    C:\test\source\source\src\server\game\Entities\Taxi\TaxiPathGraph.cpp    156    1    game Error    13    error C2780: 'void boost::dijkstra_shortest_paths(const VertexListGraph &,graph_traits<G>::vertex_descriptor,PredecessorMap,DistanceMap,WeightMap,IndexMap,Compare,Combine,DistInf,DistZero,DijkstraVisitor,const boost::bgl_named_params<T,Tag,Base> &,enable_if_c<(boost::is_base_and_derived<boost::vertex_list_graph_tag,boost::graph_traits<G>::traversal_category>::value,boost::graph::detail::no_parameter>::type)' : expects 13 arguments - 2 provided    C:\test\source\source\src\server\game\Entities\Taxi\TaxiPathGraph.cpp    156    1    game Error    14    error C2780: 'void boost::dijkstra_shortest_paths(const VertexListGraph &,SourceInputIter,SourceInputIter,PredecessorMap,DistanceMap,WeightMap,IndexMap,Compare,Combine,DistInf,DistZero,DijkstraVisitor,const boost::bgl_named_params<T,Tag,Base> &,enable_if_c<(boost::is_base_and_derived<boost::vertex_list_graph_tag,boost::graph_traits<G>::traversal_category>::value,boost::graph::detail::no_parameter>::type)' : expects 14 arguments - 2 provided    C:\test\source\source\src\server\game\Entities\Taxi\TaxiPathGraph.cpp    156    1    game Error    15    error LNK1181: cannot open input file '..\game\Release\game.lib'    C:\test\build\src\server\worldserver\LINK    worldserver  
      error.txt
    • By KevinC.
      Hey guys,
      I've got the following errors during compiling TrinityCore 6.x on a debian 8.4 machine.
       
      [ 24%] Building CXX object src/server/scripts/CMakeFiles/scripts.dir/Commands/cs_list.cpp.o In file included from /root/wow-source/trinitycore_6.x/TrinityCore/src/server/game/Achievements/AchievementMgr.h:22:0,                  from /root/wow-source/trinitycore_6.x/TrinityCore/src/server/scripts/Commands/cs_guild.cpp:25: /root/wow-source/trinitycore_6.x/TrinityCore/src/server/game/Achievements/CriteriaHandler.h:65:32: error: declaration of ‘const Criteria* CriteriaTree::Criteria’ [-fpermissive]      Criteria const* Criteria = nullptr;                                 ^ compilation terminated due to -Wfatal-errors. src/server/scripts/CMakeFiles/scripts.dir/build.make:468: recipe for target 'src/server/scripts/CMakeFiles/scripts.dir/Commands/cs_guild.cpp.o' failed make[2]: *** [src/server/scripts/CMakeFiles/scripts.dir/Commands/cs_guild.cpp.o] Error 1 make[2]: *** Waiting for unfinished jobs....  error: declaration of ‘const Criteria* CriteriaTree::Criteria’ [-fpermissive] error: declaration of ‘const Criteria* CriteriaTree::Criteria’ [-fpermissive]CMakeFiles/Makefile2:1246: recipe for target 'src/server/scripts/CMakeFiles/scripts.dir/all' failed make[1]: *** [src/server/scripts/CMakeFiles/scripts.dir/all] Error 2 Makefile:117: recipe for target 'all' failed make: *** [all] Error 2  
      Installed compiler:
      ii g++ 4:4.9.2-2 amd64 GNU C++ compiler ii g++-4.9 4.9.2-10 amd64 GNU C++ compiler ii gcc 4:4.9.2-2 amd64 GNU C compiler ii gcc-4.9 4.9.2-10 amd64 GNU C compiler using the following cmake command:
      cmake ../ -DTOOLS=1 -DUSE_COREPCH=0 -DUSE_SCRIPTPCH=0 -DSERVERS=1 -DSCRIPTS="static" -DCMAKE_INSTALL_PREFIX=/root/wow-build/trinitycore_6.x_latest -DWITH_WARNINGS=1
      surely using make -j 4
       
×
×
  • Create New...