Jump to content
TrinityCore

Recommended Posts

That "error" is caused by the real error somewhere in the log before it gets that far, look carefully through the log file and find the actual error that caused that one.

Share this post


Link to post
Share on other sites

Try reinstalling mySQL, make sure you download + install the complete package. After that, destroy your build directory, and re-run CMake to rebuild it again from zero..

Share this post


Link to post
Share on other sites

I'm not sure what to post of my output. From what I can see, it has a lot of errors.

Well, post something.

Share this post


Link to post
Share on other sites

Sorry about that guys. Did some tinkering and got it almost to succeed.

13>------ Build started: Project: worldserver, Configuration: Release Win32 ------

13>  Building Custom Rule C:/Trinity/src/server/worldserver/CMakeLists.txt

13>  CMake does not need to re-run because C:\Build\src\server\worldserver\CMakeFiles\generate.stamp is up-to-date.

13>  worldPCH.cpp

13>cl : Command line error D8030: INTERNAL COMPILER ERROR in '诌嗿赑桐哨A痿䀑謀쒃줌诃嗿噑㺃琀贊ц䀐匀庋地纍謗ᑃ쮋䖉ꨑṥ'

13>      Please choose the Technical Support command on the Visual C++

13>      Help menu, or open the Technical Support help file for more information

14>------ Build started: Project: ALL_BUILD, Configuration: Release Win32 ------

14>  Building Custom Rule C:/Trinity/CMakeLists.txt

14>  CMake does not need to re-run because C:\Build\CMakeFiles\generate.stamp is up-to-date.

========== Build: 13 succeeded, 1 failed, 0 up-to-date, 0 skipped ==========

Edit: I have no idea why my compiler is outputing something in ... whatever language that is.

Edited by Krad

Share this post


Link to post
Share on other sites

Hi! Just starting to mess with this, on Ubuntu 10.04. Cmake output looks good, as far as I can tell. When I run a make, though, I'm getting this:

. . . .

[ 2%] Building C object dep/jemalloc/CMakeFiles/jemalloc.dir/src/extent.c.o

[ 2%] Building C object dep/jemalloc/CMakeFiles/jemalloc.dir/src/chunk_swap.c.o

[ 2%] Building C object dep/jemalloc/CMakeFiles/jemalloc.dir/src/jemalloc.c.o

/tmp/ccVjwrWD.s: Assembler messages:

/tmp/ccVjwrWD.s:1329: Error: Unrecognized opcode: `pause'

make[2]: *** [dep/jemalloc/CMakeFiles/jemalloc.dir/src/jemalloc.c.o] Error 1

make[1]: *** [dep/jemalloc/CMakeFiles/jemalloc.dir/all] Error 2

make: *** [all] Error 2

I'm stumped...any ideas?

Thanks!

Share this post


Link to post
Share on other sites

Have you updated the OS?

sudo aptitude install g++ gcc make cmake libmysql++-dev subversion mercurial openssl libssl-dev zlib1g-dev libtool libmysqlclient15-dev patch build-essential mysql-client libreadline5-dev 		     		
And... test run with
sudo make
sudo make install

Update your git repo.

Share this post


Link to post
Share on other sites

Didn't know if I was supposed to be make a new topic, but seeing as how it's a different issue I thought I might.

13>------ Build started: Project: worldserver, Configuration: Release Win32 ------

13>  Building Custom Rule C:/Trinity/src/server/worldserver/CMakeLists.txt

13>  CMake does not need to re-run because C:\Build\src\server\worldserver\CMakeFiles\generate.stamp is up-to-date.

13>  worldPCH.cpp

13>cl : Command line error D8030: INTERNAL COMPILER ERROR in '诌嗿赑桐哨A痿䀑謀쒃줌诃嗿噑㺃琀贊ц䀐匀庋地纍謗ᑃ쮋䖉ꨑṥ'

13>      Please choose the Technical Support command on the Visual C++

13>      Help menu, or open the Technical Support help file for more information

14>------ Build started: Project: ALL_BUILD, Configuration: Release Win32 ------

14>  Building Custom Rule C:/Trinity/CMakeLists.txt

14>  CMake does not need to re-run because C:\Build\CMakeFiles\generate.stamp is up-to-date.

========== Build: 13 succeeded, 1 failed, 0 up-to-date, 0 skipped ==========

No, I have no idea why my debug output printed something in ... whatever language that is.

Share this post


Link to post
Share on other sites

How is this different from your other topic?

Spammer

Also, Google is your friend

http://connect.microsoft.com/VisualStudio/feedback/details/543068/internal-compiler-error-d8030-with-evidence-of-memory-corruption-during-parallel-build

Share this post


Link to post
Share on other sites

Dunno, figured someone may see the topic title of my other one, and figure they can't fix it due to the improperly named topic. Seeing as how I have a different error now. *shrug*

Edit: Interestingly enough, there is no solution or workaround on that fantastic link you posted.

Edited by Krad

Share this post


Link to post
Share on other sites

--- Canned message start

It appears the issue in the original post was solved, so this thread shall be closed. Should you encounter any other difficulties, please open a new thread.

--- Canned message end ---

Share this post


Link to post
Share on other sites

-- WARNING - Missing or outdated git - did you forget to install a recent version?

-- WARNING - Observe that for revision ID/hash to work you need at least version 1.7

-- WARNING - Continuing anyway, but setting the revision-ID and hash to Rev:0 Hash: Archive

This means something, doesn't it?

Share this post


Link to post
Share on other sites

i would like to give a heads up i solved this problem.

Look at the error message

C:\Users\Steven\Desktop\Trinity\Build\src\server\authserver\Release\authserver.lib

the Release folder at the end is not there you need to go manually and create it, its the same for authserver and worldserver. once you create the release folders it works fine. I just compiled my core :D

Share this post


Link to post
Share on other sites

--- Canned message start

It appears the issue in the original post was solved, so this thread shall be closed. Should you encounter any other difficulties, please open a new thread.

--- Canned message end ---

Share this post


Link to post
Share on other sites

Join the conversation

You can post now and register later. If you have an account, sign in now to post with your account.

Guest
Reply to this topic...

×   Pasted as rich text.   Paste as plain text instead

  Only 75 emoji are allowed.

×   Your link has been automatically embedded.   Display as a link instead

×   Your previous content has been restored.   Clear editor

×   You cannot paste images directly. Upload or insert images from URL.


  • Recently Browsing   0 members

    No registered users viewing this page.

  • Similar Content

    • By 939h
      Hi,

      The chat channel Lookup for group is not available when a player isn't in a city. I tried to modify the worldserver.conf file with:
      #
      #    Channel.RestrictedLfg
      #        Description: Restrict LookupForGroup channel to characters registered in the LFG tool.
      #        Default:     1 - (Enabled, Allow join to channel only if registered in LFG)
      #                     0 - (Disabled, Allow join to channel in any time)
      Channel.RestrictedLfg = 0

      I restarted the server but it didn't help.

      Thanks
    • By meeek
      Hey, I've been trying to compile from github the core from 6.2.3/6.2.4, I'm well aware its stopped developing. I cannot get it to configure properly in CMake, nor can I obviously build it.
       
      I'd be willing to pay for help and get this working and running. I want to develop my own server on my freetime as a learning project and for entertainment. I can't find any core for WoD, sadly.. Very hard, would appreciate any quick help
       
    • By Probie_Wan_Kenobi
      I believe everything I have done up to this point has been correct. When I go to launch worldserver.exe a console window opens up for a second and closes right away and nothing else seems to have happened. I skipped a head a little in the instructions to see what is left and step 5 seems skippable since I am running this only for this computer and step 6 has me launch to a log in screen which I can not get to. I tried going to the faq but the page was not loading properly so I am forced to post here.
    • By Wark
      I'd just like to get a little insight to why so much of the current Trinitycore code doesn't match up to a few years ago.
      Now I know I'm not a pro at coding on Trinitycore and I understand that the core is open sourced but these just seem so significant and doesn't seem right to remove this stuff.
       
      Let me give an example. Lets say I'm watching this tutorial to get a little information about classes and methods that I can use when making a script. (I've also been using the Trinitycore Code Documentation as reference as well but it also seems to show the same issues)
      Although the tutorial is a little out of date, I don't see why OnGossipSelect doesn't exist anywhere in CreatureScript and that when I try to link the script to the core code it spits out this error.
      object of abstract class type "GossipTeleporter" is not allowed:
      pure virtual function "CreatureScript::GetAI" has no overrider
      The DEFINES of "ADD_GOSSIP_ITEM" and many more don't exist either.
       
      Am I missing something? All I want to know is if the core is mean't to be this way and if not should I download an older version of the core before I put to much working into my current core.
      (I downloaded my core right from the Trinitycore website tutorial)
       
      I'm currently trying to write a simple gossipteleporter that will let you talk to an npc and teleport to the given location. It's very hard to do this when so many things just don't exist within my core.
       
      EXTRA: I pasted this into a new custom script just to see if I would get errors and I got a lot of different errors: http://pastebin.com/raw/G62e0t49
      This was obtained from here: http://www.ac-web.org/forums/showthread.php?129885-Request-Teleporter-NPC-for-TrinityCore
      By no means am I looking to copy the code from the two links above, I was using them as a test to see if my core accepted them.
       
      Thanks,
      Wark
    • By Cantte
      Well ... today I was about to compile the trinity core version for WoW 4.3.4 of this repository "https://gitlab.com/trinitycore/TrinityCore_434". Download them and when you use the cmake, I generate the solution correctly. When I began to compile this went well until I got to the last step, when I was 90% practically.
      This was the error:
      Main.obj: error LNK2019: external symbol SSLeay_version unresolved referred to in the function "public: void __cdecl <lambda_4a2d53ce610f18dba0b4b4d6532c13a7> :: operator () (void) const" (?? R <lambda_4a2d53ce610f18dba0b4b4d6532c13a7> @@ QEBAXXZ)
      25> scripts.lib (cs_server.obj): error LNK2001: external symbol SSLeay_version unresolved
      25> gsoap.lib (stdsoap2.obj): error LNK2019: unresolved sk_num external symbol referenced in the tcp_connect function
      25> gsoap.lib (stdsoap2.obj): error LNK2019: unresolved sk_value external symbol referenced in the tcp_connect function
      25> gsoap.lib (stdsoap2.obj): error LNK2019: unresolved sk_pop_free external symbol referenced in the tcp_connect function
      25> gsoap.lib (stdsoap2.obj): error LNK2019: outer symbol OPENSSL_add_all_algorithms_noconf unresolved referenced in the soap_ssl_init function
      25> gsoap.lib (stdsoap2.obj): error LNK2019: external symbol SSL_load_error_strings unresolved referenced in the soap_ssl_init function
      25> gsoap.lib (stdsoap2.obj): error LNK2019: unresolved external SSLv23_method symbol referenced in the ssl_auth_init function
      25> gsoap.lib (stdsoap2.obj): error LNK2019: external symbol SSL_library_init unresolved referenced in the soap_ssl_init function
      25> gsoap.lib (stdsoap2.obj): error LNK2019: external symbol SSL_state unresolved referenced in the tcp_connect function
      25> common.lib (OpenSSLCrypto.obj): error LNK2019: external symbol CRYPTO_num_locks unresolved referred to in the function "void __cdecl OpenSSLCrypto :: threadsCleanup (void)" (? ThreadsCleanup @ OpenSSLCrypto @@ YAXXZ)
      25> common.lib (OpenSSLCrypto.obj): error LNK2019: external symbol CRYPTO_set_locking_callback unresolved referred to in the function "void __cdecl OpenSSLCrypto :: threadsCleanup (void)" (? ThreadsCleanup @ OpenSSLCrypto @@ YAXXZ)
      25> common.lib (OpenSSLCrypto.obj): error LNK2019: external symbol CRYPTO_THREADID_set_numeric unresolved referred to in the function "void __cdecl threadIdCallback (struct crypto_threadid_st *)" (? ThreadIdCallback @@ YAXPEAUcrypto_threadid_st @@@ Z)
      25> common.lib (OpenSSLCrypto.obj): error LNK2019: external symbol CRYPTO_THREADID_set_callback unresolved referenced in the function "void __cdecl OpenSSLCrypto :: threadsCleanup (void)" (? ThreadsCleanup @ OpenSSLCrypto @@ YAXXZ)
      25> common.lib (ARC4.obj): error LNK2019: external symbol EVP_CIPHER_CTX_init unresolved referred to in the function "public: __cdecl ARC4 :: ARC4 (unsigned int)" (?? 0ARC4 @@ QEAA @ I @ Z)
      25> common.lib (HmacHash.obj): error LNK2019: unresolved HMAC_CTX_init external symbol referenced in the "struct hmac_ctx_st * __cdecl HMAC_CTX_new (void)" function (? HMAC_CTX_new @@ YAPEAUhmac_ctx_st @@ XZ)
      25> common.lib (HmacHash.obj): error LNK2019: unresolved HMAC_CTX_cleanup external symbol referenced in the "void __cdecl HMAC_CTX_free (struct hmac_ctx_st *)" function (? HMAC_CTX_free @@ YAXPEAUhmac_ctx_st @@@ Z)
      25> E: \ Server-Wow \ TrinityCore_434-4.3.4 \ Build \ bin \ RelWithDebInfo \ worldserver.exe: fatal error LNK1120: 16 external unresolved
      25> Compilation of the "worldserver.vcxproj" project completed - ERROR.
      26> ------ Compile operation started: project: ALL_BUILD, configuration: RelWithDebInfo x64 ------
      26> Building Custom Rule E: /Server-Wow/TrinityCore_434-4.3.4/CMakeLists.txt
      26> CMake does not need to re-run because E: /Server-Wow/TrinityCore_434-4.3.4/Build/CMakeFiles/generate.stamp is up-to-date.
      ========== Compile: 23 correct, 3 incorrect, 0 updated, 0 omitted ==========
       
      And this is the original error in Spanish (since I use the compiler in Spanish)
       
      Main.obj : error LNK2019: símbolo externo SSLeay_version sin resolver al que se hace referencia en la función "public: void __cdecl <lambda_4a2d53ce610f18dba0b4b4d6532c13a7>::operator()(void)const " (??R<lambda_4a2d53ce610f18dba0b4b4d6532c13a7>@@QEBAXXZ)
      25>scripts.lib(cs_server.obj) : error LNK2001: símbolo externo SSLeay_version sin resolver
      25>gsoap.lib(stdsoap2.obj) : error LNK2019: símbolo externo sk_num sin resolver al que se hace referencia en la función tcp_connect
      25>gsoap.lib(stdsoap2.obj) : error LNK2019: símbolo externo sk_value sin resolver al que se hace referencia en la función tcp_connect
      25>gsoap.lib(stdsoap2.obj) : error LNK2019: símbolo externo sk_pop_free sin resolver al que se hace referencia en la función tcp_connect
      25>gsoap.lib(stdsoap2.obj) : error LNK2019: símbolo externo OPENSSL_add_all_algorithms_noconf sin resolver al que se hace referencia en la función soap_ssl_init
      25>gsoap.lib(stdsoap2.obj) : error LNK2019: símbolo externo SSL_load_error_strings sin resolver al que se hace referencia en la función soap_ssl_init
      25>gsoap.lib(stdsoap2.obj) : error LNK2019: símbolo externo SSLv23_method sin resolver al que se hace referencia en la función ssl_auth_init
      25>gsoap.lib(stdsoap2.obj) : error LNK2019: símbolo externo SSL_library_init sin resolver al que se hace referencia en la función soap_ssl_init
      25>gsoap.lib(stdsoap2.obj) : error LNK2019: símbolo externo SSL_state sin resolver al que se hace referencia en la función tcp_connect
      25>common.lib(OpenSSLCrypto.obj) : error LNK2019: símbolo externo CRYPTO_num_locks sin resolver al que se hace referencia en la función "void __cdecl OpenSSLCrypto::threadsCleanup(void)" ([email protected]@@YAXXZ)
      25>common.lib(OpenSSLCrypto.obj) : error LNK2019: símbolo externo CRYPTO_set_locking_callback sin resolver al que se hace referencia en la función "void __cdecl OpenSSLCrypto::threadsCleanup(void)" ([email protected]@@YAXXZ)
      25>common.lib(OpenSSLCrypto.obj) : error LNK2019: símbolo externo CRYPTO_THREADID_set_numeric sin resolver al que se hace referencia en la función "void __cdecl threadIdCallback(struct crypto_threadid_st *)" ([email protected]@[email protected]@@Z)
      25>common.lib(OpenSSLCrypto.obj) : error LNK2019: símbolo externo CRYPTO_THREADID_set_callback sin resolver al que se hace referencia en la función "void __cdecl OpenSSLCrypto::threadsCleanup(void)" ([email protected]@@YAXXZ)
      25>common.lib(ARC4.obj) : error LNK2019: símbolo externo EVP_CIPHER_CTX_init sin resolver al que se hace referencia en la función "public: __cdecl ARC4::ARC4(unsigned int)" ([email protected]@[email protected]@Z)
      25>common.lib(HmacHash.obj) : error LNK2019: símbolo externo HMAC_CTX_init sin resolver al que se hace referencia en la función "struct hmac_ctx_st * __cdecl HMAC_CTX_new(void)" ([email protected]@[email protected]@XZ)
      25>common.lib(HmacHash.obj) : error LNK2019: símbolo externo HMAC_CTX_cleanup sin resolver al que se hace referencia en la función "void __cdecl HMAC_CTX_free(struct hmac_ctx_st *)" ([email protected]@[email protected]@@Z)
      25>E:\Server-Wow\TrinityCore_434-4.3.4\Build\bin\RelWithDebInfo\worldserver.exe : fatal error LNK1120: 16 externos sin resolver
      25>Compilación del proyecto "worldserver.vcxproj" terminada -- ERROR.
      26>------ Operación Compilar iniciada: proyecto: ALL_BUILD, configuración: RelWithDebInfo x64 ------
      26>Building Custom Rule E:/Server-Wow/TrinityCore_434-4.3.4/CMakeLists.txt
      26>CMake does not need to re-run because E:/Server-Wow/TrinityCore_434-4.3.4/Build/CMakeFiles/generate.stamp is up-to-date.
      ========== Compilar: 23 correctos, 3 incorrectos, 0 actualizados, 0 omitidos ==========
       
       
      Thanks.
×
×
  • Create New...