Jump to content
TrinityCore

Recommended Posts

With the newest Rev of Trinity i have this error:

 

[  4%] Building CXX object dep/g3dlite/CMakeFiles/g3dlib.dir/source/debugAssert.cpp.o
[  4%] Building CXX object dep/g3dlite/CMakeFiles/g3dlib.dir/source/FileSystem.cpp.o
/home/wow/TrinityCore/dep/g3dlite/source/FileSystem.cpp: In member function 'void G3D::FileSystem::_clearCache(const string&)':
/home/wow/TrinityCore/dep/g3dlite/source/FileSystem.cpp:326:6: internal compiler error: segmentation fault
Please submit a full bug report,
with preprocessed source if appropriate.

The bug is not reproducible, so it is likely a hardware or OS problem.
make[2]: *** [dep/g3dlite/CMakeFiles/g3dlib.dir/source/FileSystem.cpp.o] Error 1
make[1]: *** [dep/g3dlite/CMakeFiles/g3dlib.dir/all] Error 2
make: *** [all] Error 2
 

Link to comment
Share on other sites

With the newest Rev of Trinity i have this error:

 

[  4%] Building CXX object dep/g3dlite/CMakeFiles/g3dlib.dir/source/debugAssert.cpp.o

[  4%] Building CXX object dep/g3dlite/CMakeFiles/g3dlib.dir/source/FileSystem.cpp.o

/home/wow/TrinityCore/dep/g3dlite/source/FileSystem.cpp: In member function 'void G3D::FileSystem::_clearCache(const string&)':

/home/wow/TrinityCore/dep/g3dlite/source/FileSystem.cpp:326:6: internal compiler error: segmentation fault

Please submit a full bug report,

with preprocessed source if appropriate.

The bug is not reproducible, so it is likely a hardware or OS problem.

make[2]: *** [dep/g3dlite/CMakeFiles/g3dlib.dir/source/FileSystem.cpp.o] Error 1

make[1]: *** [dep/g3dlite/CMakeFiles/g3dlib.dir/all] Error 2

make: *** [all] Error 2

Read the bold.

Link to comment
Share on other sites

Hello everybody,

 

I have this error while compiling :

[  9%] Building CXX object src/server/shared/CMakeFiles/sharedPCH.cpp_dephelp.di r/PrecompiledHeaders/sharedPCH.cpp.o

Linking CXX shared module libsharedPCH.cpp_dephelp.so

[  9%] Built target sharedPCH.cpp_dephelp

Scanning dependencies of target generate_sharedPCH.cpp

[  9%] Generating sharedPCH.h.gch

[  9%] Built target generate_sharedPCH.cpp

Scanning dependencies of target shared

[  9%] Building CXX object src/server/shared/CMakeFiles/shared.dir/Configuration /Config.cpp.o

c++: internal compiler error: segmentation fault (program cc1plus)

Please submit a full bug report,

with preprocessed source if appropriate.

make[2]: *** [src/server/shared/CMakeFiles/shared.dir/Configuration/Config.cpp.o ] Error 4

make[1]: *** [src/server/shared/CMakeFiles/shared.dir/all] Error 2

make: *** [all] Error 2

 

 

 

Ace Version is 6.0.3

Openssl Version is  1.0.1e

System is: Linux Debian 7  64 bits

Gcc Version: (Debian 4.7.2-5) 4.7.2

 

 

Thank you for your help.

 

I havn't seen this error before. I'm running CentOS and another LinuxMint 15 box. Both without that error.

Did you guys dive through your dmesg or /proc directories to see any kind of error during boot up?

 

Also, something else that seemed strange that I havn't seen on Linux was this:

internal compiler error: segmentation fault

Something doesn't seem right. I don't mind if you guys cat an output of the dmesg on pastebin a PM to me.

Link to comment
Share on other sites

And it was 1.0.1e and not 1.0.1e Light? Btw, assuming you're using windows -- C:OpenSSL-Win32. The readme should yield the version you're using.

 

"OpenSSL 1.0.1e"

 

Is what it says at the top. Could it be that I am using OpenSSL's Win64 includes folder and root folder? Because GIT asks for the Include/Root dir of OpenSSL and that's the one I'm using

Link to comment
Share on other sites

Same error on Debian 6 and 7 x64, procesor IntelCore i5, RAM and SWAP: 16GB

 

[ 10%] Built target generate_worldPCH.cpp

[ 10%] [ 10%] [ 10%] Building CXX object src/server/shared/CMakeFiles/shared.dir/Cryptography/ARC4.cpp.o

Building CXX object src/server/shared/CMakeFiles/shared.dir/Cryptography/SHA1.cpp.o

Building CXX object src/server/shared/CMakeFiles/shared.dir/Configuration/Config.cpp.o

c++: Internal error: Segmentation fault (program cc1plus)

Please submit a full bug report.

c++: Internal error: Segmentation fault (program cc1plus)

Please submit a full bug report.

make[2]: *** [src/server/shared/CMakeFiles/shared.dir/Cryptography/ARC4.cpp.o] Error 1

make[2]: *** Waiting for unfinished jobs....

make[2]: *** [src/server/shared/CMakeFiles/shared.dir/Configuration/Config.cpp.o] Error 1

c++: Internal error: Segmentation fault (program cc1plus)

Please submit a full bug report.

make[2]: *** [src/server/shared/CMakeFiles/shared.dir/Cryptography/SHA1.cpp.o] Error 1

make[1]: *** [src/server/shared/CMakeFiles/shared.dir/all] Error 2

make[1]: *** Waiting for unfinished jobs....

[ 10%] Built target revision.h

make: *** [all] Error 2

 

:S

Edited by Dekadence
Link to comment
Share on other sites

Hello users,

I'm trying to compile Trinitycore 4.3.4 server, all necessary libraries and files of type OpenSSL are updated on latest version. Error occurs when compiling. I do not know how to solve this problem.

[ 10%] Building CXX object src/server/shared/CMakeFiles/shared.dir/Cryptography/OpenSSLCrypto.cpp.o
/root/DDtc/TrinityCore/src/server/shared/Cryptography/OpenSSLCrypto.cpp:34: error: variable or field 'threadIdCallback' declared void
/root/DDtc/TrinityCore/src/server/shared/Cryptography/OpenSSLCrypto.cpp:34: error: 'CRYPTO_THREADID' was not declared in this scope
/root/DDtc/TrinityCore/src/server/shared/Cryptography/OpenSSLCrypto.cpp:34: error: 'id' was not declared in this scope
/root/DDtc/TrinityCore/src/server/shared/Cryptography/OpenSSLCrypto.cpp: In function 'void OpenSSLCrypto::threadsSetup()':
/root/DDtc/TrinityCore/src/server/shared/Cryptography/OpenSSLCrypto.cpp:46: error: 'threadIdCallback' was not declared in this scope
/root/DDtc/TrinityCore/src/server/shared/Cryptography/OpenSSLCrypto.cpp:46: error: 'CRYPTO_THREADID_set_callback' was not declared in this scope
/root/DDtc/TrinityCore/src/server/shared/Cryptography/OpenSSLCrypto.cpp: In function 'void OpenSSLCrypto::threadsCleanup()':
/root/DDtc/TrinityCore/src/server/shared/Cryptography/OpenSSLCrypto.cpp:53: error: 'CRYPTO_THREADID_set_callback' was not declared in this scope
make[2]: *** [src/server/shared/CMakeFiles/shared.dir/Cryptography/OpenSSLCrypto.cpp.o] Error 1
make[1]: *** [src/server/shared/CMakeFiles/shared.dir/all] Error 2
make: *** [all] Error 2

Please help. I would like to also ask how it is possible that at various repack have a database AI and TDB from you is not there? I download last version from GITHUB,but i dont know where is the problem :/

Edited by Orangs
Link to comment
Share on other sites

Join the conversation

You can post now and register later. If you have an account, sign in now to post with your account.

Guest
Reply to this topic...

×   Pasted as rich text.   Paste as plain text instead

  Only 75 emoji are allowed.

×   Your link has been automatically embedded.   Display as a link instead

×   Your previous content has been restored.   Clear editor

×   You cannot paste images directly. Upload or insert images from URL.

 Share

  • Recently Browsing   0 members

    No registered users viewing this page.


  • Similar Content

    • By xgamerninjax
      Hello all, first time posting here and it's really got me scratching my head.
      I've compiled everything on my own computer, and then transferred everything to a host computer so the server can stay live. The server was running fine for a month or so and then suddenly it just crashes when it hits "Loading C++ scripts", exiting saying "caught signal 22"
      I tried setting up the host computer from scratch and transferred everything over fresh and it's still happening for some reason. (Note, I can run the server perfectly on my personal pc where I compiled it.)
      Any help would be greatly appreciated, thanks!
      3d7e3a40e2b3+_worldserver.exe_[1-4_15-19-45].dmp 3d7e3a40e2b3+_worldserver.exe_[1-4_15-19-45].txt
    • By Deer_Hunter
      Hello all,
      I just updated from the latest Git 
      Trinity Core REV. ac6baa547376 + 2020-02-21  3.3.5 Branch.
      I'm getting this error after crash.
      Problem signature:
        Problem Event Name:    APPCRASH
        Application Name:    worldserver.exe
        Application Version:    0.0.0.0
        Application Timestamp:    5e50a462
        Fault Module Name:    StackHash_f12f
        Fault Module Version:    6.3.9600.19629
        Fault Module Timestamp:    5e2fdc0d
        Exception Code:    c0000374
        Exception Offset:    PCH_9E_FROM_ntdll+0x0000000000090D0A
        OS Version:    6.3.9600.2.0.0.272.7
        Locale ID:    1033
        Additional Information 1:    f12f
        Additional Information 2:    f12f0934d3e965f73c68e60f20f2cd40
        Additional Information 3:    7595
        Additional Information 4:    7595e4d8d703db9dcd3d2f6ea540e357
      the exception code says its a Heap error,  I'm not sure how to troubleshoot this.
      Thanks
    • By 939h
      Hi,

      The chat channel Lookup for group is not available when a player isn't in a city. I tried to modify the worldserver.conf file with:
      #
      #    Channel.RestrictedLfg
      #        Description: Restrict LookupForGroup channel to characters registered in the LFG tool.
      #        Default:     1 - (Enabled, Allow join to channel only if registered in LFG)
      #                     0 - (Disabled, Allow join to channel in any time)
      Channel.RestrictedLfg = 0

      I restarted the server but it didn't help.

      Thanks
    • By meeek
      Hey, I've been trying to compile from github the core from 6.2.3/6.2.4, I'm well aware its stopped developing. I cannot get it to configure properly in CMake, nor can I obviously build it.
       
      I'd be willing to pay for help and get this working and running. I want to develop my own server on my freetime as a learning project and for entertainment. I can't find any core for WoD, sadly.. Very hard, would appreciate any quick help
       
    • By Probie_Wan_Kenobi
      I believe everything I have done up to this point has been correct. When I go to launch worldserver.exe a console window opens up for a second and closes right away and nothing else seems to have happened. I skipped a head a little in the instructions to see what is left and step 5 seems skippable since I am running this only for this computer and step 6 has me launch to a log in screen which I can not get to. I tried going to the faq but the page was not loading properly so I am forced to post here.
×
×
  • Create New...