Jump to content
TrinityCore

Recommended Posts

Hello Staff,

I've just Pulled All Recent Commit's from 4 days Ago and I Got an Error Saying "AreaBoundary Multiple Default Contstructs"

I had Fixed that Error with A Pull Request from @treeston which is 2083b4b1a4e4dd4fa6e670deb24b1380f1b07468

That Fixed it but introduced 2 New Errors:

Error 19 error LNK1181: cannot open input file '..\scripts\Release\scripts.lib' E:\Trinity\Build\Build7\src\server\worldserver\LINK worldserver

and

Error 17 error C2582: 'operator =' function is unavailable in 'BossBoundaryEntry' (E:\Trinity\Source_3.3.5_Work\src\server\scripts\Northrend\IcecrownCitadel\instance_icecrown_citadel.cpp) C:\Program Files (x86)\Microsoft Visual Studio 12.0\VC\include\utility 53 1 scripts

These Errors are in Visual Studio 2013 Express on a Windows 10 x64 Pro. On CMake I had Gotten no Errors & I have Tried tis on a Fresh Source & My Normal One.

Both Replicated the Same Error & Wouldn't let me Compile.

If there is Anyone who can Help me, I'd Greatly Appreciate it

Thanks,

TeamCDA

Share this post


Link to post
Share on other sites

"Got an Error Saying "AreaBoundary Multiple Default Contstructs"" is not really a way to report build errors, you should post the full log of that error with filename and line and specify if there is any custom modification.

Share this post


Link to post
Share on other sites

Whatever it was, it seems to have been fixed in a recent commit as I've just pulled the 3.3.5 branch a couple of minutes ago and got a successful x64 build

 

Compiled using Visual Studio 2015 on Windows 10 Pro x64

Share this post


Link to post
Share on other sites
32 minutes ago, TehGuy said:

Whatever it was, it seems to have been fixed in a recent commit as I've just pulled the 3.3.5 branch a couple of minutes ago and got a successful x64 build

 

Compiled using Visual Studio 2015 on Windows 10 Pro x64

I Now have a New Problem as I'd fixed both those errors now

It's also in 6.2.3. I've installed all recent 6.2.3 Commits. Cmake & VS 2013 Express Update 5 No Errors. I went into my Patched Client & All my Realms are Red and say Incompatible.

 

Any Suggestions???

Share this post


Link to post
Share on other sites

Hi guys, Have an error in Microsoft Visual Studio 2013 ultimate update 5
I can't compile this version Trinity, need help for resolve this problem =/
In CMake all compile success, in MVS not.

error.jpg

Share this post


Link to post
Share on other sites

*sigh* Alrighty @Nay I am just about to the point to offer $100 for anyone who can get this dang server running correctly without a repack.

Here is the latest screenshot of what is going on. I have followed the FAQ and still run into this error. Please take a look and tell me what you think. I am trying to compile a 3.3.5 server.

ScreenHunter_08 Jan. 18 16.00.jpg

Share this post


Link to post
Share on other sites

Can you compile the 3.3.5 branch or is it the same error?

 

Edit: mysql installed automatically the x64 version, when you selected "typical install" on a x64 machine. 

Edited by Moerzl

Share this post


Link to post
Share on other sites

Like you said, was, you are now 10 days oudated, update your sources, compile and reimport auth and characters databases and leave autoupdater do the work.

Share this post


Link to post
Share on other sites

It is not enough only change mysql to x64 bit. You must download all in x86 or x64.

I take some pictures from the installation. 

Install the following software for x64: Requirements- TrinityCore

In "mysql-installer-community-5.6.28.0" choose this:

  • see pictures

In cmake choose this for x64:

  • see picture

In VS 2013 move to "BUILD" -> "Configuration Manager" -> change "Debug" to "Release" and choose "x64" right.

Close the window and right-click on "ALL_BUILD" -> choose "Clean" -> right-click again and chose "Build".

 

That's all :D

mysql_3.JPG

mysql_4.JPG

mysql_2.JPG

mysql_1.JPG

cmake.JPG

Edited by Moerzl

Share this post


Link to post
Share on other sites

Hi, 

I am having a hard time compiling branch 3.3.5 on a fresh Ubuntu 15.04 install.

I have followed the tutorial line by line and can't figure out what is wrong.

I keep getting this error :

[  9%] Building CXX object src/common/CMakeFiles/common.dir/Common.cpp.o

c++: internal compiler error: Segmentation fault (program cc1plus)
Please submit a full bug report,
with preprocessed source if appropriate.
See <file:///usr/share/doc/gcc-4.9/README.Bugs> for instructions.
src/common/CMakeFiles/common.dir/build.make:54: recipe for target 'src/common/CMakeFiles/common.dir/Common.cpp.o' failed
make[2]: *** [src/common/CMakeFiles/common.dir/Common.cpp.o] Error 4
CMakeFiles/Makefile2:582: recipe for target 'src/common/CMakeFiles/common.dir/all' failed
make[1]: *** [src/common/CMakeFiles/common.dir/all] Error 2
Makefile:117: recipe for target 'all' failed
make: *** [all] Error 2

 

Here are all the things that I did.

On a fresh / clean install, I ran the following command as root : 

sudo apt-get install build-essential autoconf libtool gcc g++ make cmake git-core wget p7zip-full libncurses5-dev zlib1g-dev libbz2-dev

sudo apt-get install openssl libssl-dev mysql-server mysql-client libmysqlclient-dev libmysql++-dev libreadline6-dev

sudo apt-get install libboost-dev libboost-thread-dev libboost-system-dev libboost-filesystem-dev libboost-program-options-dev libboost-iostreams-dev

 

Then, as the "wow" user : 

cd ~/emulator/ 

git clone -b 3.3.5 git://github.com/TrinityCore/TrinityCore.git

cd TrinityCore

mkdir build

cd build

cmake ../ -DCMAKE_INSTALL_PREFIX=/home/wow/emulator/server -DCONF_DIR=/home/wow/emulator/server/etc -DTOOLS=1 -DWITH_WARNINGS=

Share this post


Link to post
Share on other sites

Hello,

I am trying to install TC 3.3.5 on a Centos 6.7.

I followed the wiki (additionally I've updated yum and added devtoolset) and when I reached to the compile part, the "make" command raised the following error:

/home/nidark/TrinityCore/src/server/database/Database/MySQLConnection.cpp: In member function ‘bool MySQLConnection::_HandleMySQLErrno(uint32)’:

/home/nidark/TrinityCore/src/server/database/Database/MySQLConnection.cpp:515:13: error: ‘sleep_for’ is not a member of ‘std::this_thread’ compilation terminated due to -Wfatal-errors.

 

Not sure if this can help, but I have mysql 5.1.73 .... installed by whoever installed the machine initially and I haven't setup anything.

When I yum install it, it said it doe not have a mysql-client to install and that the latest version.  

 

Can somebody help / give me a hint ?

 

I attached full make log, and also the cmake (previous step).

TCBuildError.rtf

Share this post


Link to post
Share on other sites

--- Canned message start ---

If this is your 1st time with TrinityCore read http://collab.kpsn.org/display/tc/TrinityCore+Home

Also read http://www.trinitycore.org/f/topic/1518-trouble-with-your-trinity-install-readme-1st-faqs/ and http://www.trinitycore.org/f/topic/10656-updating-or-starting-with-trinitycore-issues/

Also please Look in upper right hand corner of the forum, there is a button labeled search field, feel free to search for your issues first before posting, most questions like this one have already been answered.

If you still cannot find the answers you seek feel free to make a post and tell us the steps you took to resolve this issue and we will do our best to help you.

--- Canned message end ---

Share this post


Link to post
Share on other sites
On 1/22/2016, 11:13:48, nidark said:

Hello,

I am trying to install TC 3.3.5 on a Centos 6.7.

I followed the wiki (additionally I've updated yum and added devtoolset) and when I reached to the compile part, the "make" command raised the following error:

/home/nidark/TrinityCore/src/server/database/Database/MySQLConnection.cpp: In member function ‘bool MySQLConnection::_HandleMySQLErrno(uint32)’:

 

/home/nidark/TrinityCore/src/server/database/Database/MySQLConnection.cpp:515:13: error: ‘sleep_for’ is not a member of ‘std::this_thread’ compilation terminated due to -Wfatal-errors.

 

Not sure if this can help, but I have mysql 5.1.73 .... installed by whoever installed the machine initially and I haven't setup anything.

When I yum install it, it said it doe not have a mysql-client to install and that the latest version.  

 

Can somebody help / give me a hint ?

 

I attached full make log, and also the cmake (previous step).

TCBuildError.rtf

 

Any ideea :( ?

Share this post


Link to post
Share on other sites

Hi hope someone can help me out with a problem I got.
Everytime I try to compile trinitycore on Debian 7.9 I got this error during boost check:

Performing Test boost_filesystem_copy_links_without_NO_SCOPED_ENUM - Failed

 

This is the full log of configuration:

cmake ../ -DCMAKE_INSTALL_PREFIX=/home/trinity/server -DWITH_WARNINGS=1
-- Detected 64-bit platform
-- UNIX: Using jemalloc
-- UNIX: Using default configuration directory
-- UNIX: Using default library directory
-- UNIX: Configuring uninstall target
-- UNIX: Created uninstall target
-- UNIX: Detected compiler: /usr/bin/gcc
-- GCC: Enabled c++11 support
-- GCC: Enabled C99 support
-- GCC: SFMT enabled, SSE2 flags forced
-- GCC: All warnings enabled
-- Found OpenSSL library: /usr/lib/x86_64-linux-gnu/libssl.so;/usr/lib/x86_64-linux-gnu/libcrypto.so
-- Found OpenSSL headers: /usr/include
-- Using mysql-config: /usr/bin/mysql_config
-- Found MySQL library: /usr/lib/x86_64-linux-gnu/libmysqlclient_r.so
-- Found MySQL headers: /usr/include/mysql
-- Found MySQL executable: /usr/bin/mysql
-- Boost version: 1.51.0
-- Found the following Boost libraries:
--   system
--   filesystem
--   thread
--   program_options
--   iostreams
--   regex
-- Performing Test boost_filesystem_copy_links_without_NO_SCOPED_ENUM
-- Performing Test boost_filesystem_copy_links_without_NO_SCOPED_ENUM - Failed
-- Found Readline library: /usr/lib/x86_64-linux-gnu/libreadline.so
-- Include dir is: /usr/include
-- Found git binary : /usr/bin/git

* TrinityCore revision   : f5bd7b903ccd 2016-01-23 13:30:07 +0100 (3.3.5 branch)
* TrinityCore buildtype  : Release

* Install core to        : /home/trinity/server
* Install libraries to   : /home/trinity/server/lib
* Install configs to     : /home/trinity/server/etc

* Build world/auth       : Yes (default)
* Build with scripts     : Yes (default)
* Build map/vmap tools   : No  (default)
* Build core w/PCH       : Yes (default)
* Build scripts w/PCH    : Yes (default)
* Show all warnings      : Yes
* Use coreside debug     : No  (default)
* Show source tree       : No  (default)
* Use GIT revision hash  : Yes

-- Using mysql-config: /usr/bin/mysql_config
-- Found MySQL library: /usr/lib/x86_64-linux-gnu/libmysqlclient_r.so
-- Found MySQL headers: /usr/include/mysql
-- Found MySQL executable: /usr/bin/mysql
-- SCRIPT PREPARATIONS
  -> Prepared: Spells
  -> Prepared: Commands
  -> Prepared: Custom
  -> Prepared: World
  -> Prepared: Outdoor PVP Zones
  -> Prepared: Eastern Kingdoms
  -> Prepared: Kalimdor
  -> Prepared: Outland
  -> Prepared: Northrend
  -> Prepared: Events
  -> Prepared: Pet
-- SCRIPT PREPARATION COMPLETE

-- Configuring done
-- Generating done
-- Build files have been written to: /home/trinity/TrinityCore/build
 

---------------------------------------------------------------------------------------------------------------------

This error and some before appears within compiling procress :

UpdateFetcher.cpp:(.text._ZNSt8_Rb_treeISt4pairIN5boost10filesystem4pathEN13UpdateFetcher5StateEES6_St9_IdentityIS6_ENS4_11PathCompareESaIS6_EE16_M_insert_uniqueIRKS6_EES0_ISt17_Rb_tree_iteratorIS6_EbEOT_[_ZNSt8_Rb_treeISt4pairIN5boost10filesystem4pathEN13UpdateFetcher5StateEES6_St9_IdentityIS6_ENS4_11PathCompareESaIS6_EE16_M_insert_uniqueIRKS6_EES0_ISt17_Rb_tree_iteratorIS6_EbEOT_]+0x48): undefined reference to `boost::filesystem::path::filename() const'
collect2: error: ld returned 1 exit status
make[2]: *** [src/server/authserver/authserver] Error 1
make[1]: *** [src/server/authserver/CMakeFiles/authserver.dir/all] Error 2
 

I also have tryed to use other versions of boost 1.49 and 1.55 but I still got the same error

Hope someone could help me there. Thank you

Edited by Delirus

Share this post


Link to post
Share on other sites

@Nay So here is the latest headache. I followed what @Aokromes suggested and redownloaded everything last night and compiled. Here is what I get:

Auth server doesn't start, shows no errors.

 

World Server starts, gets to this point "[1146] Table 'characters.updates_include' doesn't exist
Your database structure is not up to date. Please make sure you've executed all queries in the sql/updates folders."

All files were redownloaded yesterday. I checked the settings to ensure that the "Updates.EnableDatabases = 7" is listed.

 

Ideas would be greatly appreciated. 

Offering remote assistance would be FABULOUS!!! 

Let me know either way please.

Share this post


Link to post
Share on other sites

Hi i just wanted to install back a 3.3.5 version on my pc to updates my old scripts but i got this error while compiling :

error C1027: Inconsistent values for /Ym between creation and use of precompiled header

Now my others sources doesn't compile anymore. basically, my compiler is broken.

i Searched Online they say that we should put /Zm1000 : https://msdn.microsoft.com/en-us/library/bdscwf1c.aspx

but.. i can't find anywhere where i could put it, In the project properties there's no "Configuration Properties, C/C++, Command Line"

+ i re-installed everything for Core Compilation and the error is still here.

 

any one got an idea ?

 

 

Share this post


Link to post
Share on other sites

Join the conversation

You can post now and register later. If you have an account, sign in now to post with your account.

Guest
Reply to this topic...

×   Pasted as rich text.   Paste as plain text instead

  Only 75 emoji are allowed.

×   Your link has been automatically embedded.   Display as a link instead

×   Your previous content has been restored.   Clear editor

×   You cannot paste images directly. Upload or insert images from URL.


  • Recently Browsing   0 members

    No registered users viewing this page.

  • Similar Content

    • By 939h
      Hi,

      The chat channel Lookup for group is not available when a player isn't in a city. I tried to modify the worldserver.conf file with:
      #
      #    Channel.RestrictedLfg
      #        Description: Restrict LookupForGroup channel to characters registered in the LFG tool.
      #        Default:     1 - (Enabled, Allow join to channel only if registered in LFG)
      #                     0 - (Disabled, Allow join to channel in any time)
      Channel.RestrictedLfg = 0

      I restarted the server but it didn't help.

      Thanks
    • By meeek
      Hey, I've been trying to compile from github the core from 6.2.3/6.2.4, I'm well aware its stopped developing. I cannot get it to configure properly in CMake, nor can I obviously build it.
       
      I'd be willing to pay for help and get this working and running. I want to develop my own server on my freetime as a learning project and for entertainment. I can't find any core for WoD, sadly.. Very hard, would appreciate any quick help
       
    • By Probie_Wan_Kenobi
      I believe everything I have done up to this point has been correct. When I go to launch worldserver.exe a console window opens up for a second and closes right away and nothing else seems to have happened. I skipped a head a little in the instructions to see what is left and step 5 seems skippable since I am running this only for this computer and step 6 has me launch to a log in screen which I can not get to. I tried going to the faq but the page was not loading properly so I am forced to post here.
    • By Wark
      I'd just like to get a little insight to why so much of the current Trinitycore code doesn't match up to a few years ago.
      Now I know I'm not a pro at coding on Trinitycore and I understand that the core is open sourced but these just seem so significant and doesn't seem right to remove this stuff.
       
      Let me give an example. Lets say I'm watching this tutorial to get a little information about classes and methods that I can use when making a script. (I've also been using the Trinitycore Code Documentation as reference as well but it also seems to show the same issues)
      Although the tutorial is a little out of date, I don't see why OnGossipSelect doesn't exist anywhere in CreatureScript and that when I try to link the script to the core code it spits out this error.
      object of abstract class type "GossipTeleporter" is not allowed:
      pure virtual function "CreatureScript::GetAI" has no overrider
      The DEFINES of "ADD_GOSSIP_ITEM" and many more don't exist either.
       
      Am I missing something? All I want to know is if the core is mean't to be this way and if not should I download an older version of the core before I put to much working into my current core.
      (I downloaded my core right from the Trinitycore website tutorial)
       
      I'm currently trying to write a simple gossipteleporter that will let you talk to an npc and teleport to the given location. It's very hard to do this when so many things just don't exist within my core.
       
      EXTRA: I pasted this into a new custom script just to see if I would get errors and I got a lot of different errors: http://pastebin.com/raw/G62e0t49
      This was obtained from here: http://www.ac-web.org/forums/showthread.php?129885-Request-Teleporter-NPC-for-TrinityCore
      By no means am I looking to copy the code from the two links above, I was using them as a test to see if my core accepted them.
       
      Thanks,
      Wark
    • By Cantte
      Well ... today I was about to compile the trinity core version for WoW 4.3.4 of this repository "https://gitlab.com/trinitycore/TrinityCore_434". Download them and when you use the cmake, I generate the solution correctly. When I began to compile this went well until I got to the last step, when I was 90% practically.
      This was the error:
      Main.obj: error LNK2019: external symbol SSLeay_version unresolved referred to in the function "public: void __cdecl <lambda_4a2d53ce610f18dba0b4b4d6532c13a7> :: operator () (void) const" (?? R <lambda_4a2d53ce610f18dba0b4b4d6532c13a7> @@ QEBAXXZ)
      25> scripts.lib (cs_server.obj): error LNK2001: external symbol SSLeay_version unresolved
      25> gsoap.lib (stdsoap2.obj): error LNK2019: unresolved sk_num external symbol referenced in the tcp_connect function
      25> gsoap.lib (stdsoap2.obj): error LNK2019: unresolved sk_value external symbol referenced in the tcp_connect function
      25> gsoap.lib (stdsoap2.obj): error LNK2019: unresolved sk_pop_free external symbol referenced in the tcp_connect function
      25> gsoap.lib (stdsoap2.obj): error LNK2019: outer symbol OPENSSL_add_all_algorithms_noconf unresolved referenced in the soap_ssl_init function
      25> gsoap.lib (stdsoap2.obj): error LNK2019: external symbol SSL_load_error_strings unresolved referenced in the soap_ssl_init function
      25> gsoap.lib (stdsoap2.obj): error LNK2019: unresolved external SSLv23_method symbol referenced in the ssl_auth_init function
      25> gsoap.lib (stdsoap2.obj): error LNK2019: external symbol SSL_library_init unresolved referenced in the soap_ssl_init function
      25> gsoap.lib (stdsoap2.obj): error LNK2019: external symbol SSL_state unresolved referenced in the tcp_connect function
      25> common.lib (OpenSSLCrypto.obj): error LNK2019: external symbol CRYPTO_num_locks unresolved referred to in the function "void __cdecl OpenSSLCrypto :: threadsCleanup (void)" (? ThreadsCleanup @ OpenSSLCrypto @@ YAXXZ)
      25> common.lib (OpenSSLCrypto.obj): error LNK2019: external symbol CRYPTO_set_locking_callback unresolved referred to in the function "void __cdecl OpenSSLCrypto :: threadsCleanup (void)" (? ThreadsCleanup @ OpenSSLCrypto @@ YAXXZ)
      25> common.lib (OpenSSLCrypto.obj): error LNK2019: external symbol CRYPTO_THREADID_set_numeric unresolved referred to in the function "void __cdecl threadIdCallback (struct crypto_threadid_st *)" (? ThreadIdCallback @@ YAXPEAUcrypto_threadid_st @@@ Z)
      25> common.lib (OpenSSLCrypto.obj): error LNK2019: external symbol CRYPTO_THREADID_set_callback unresolved referenced in the function "void __cdecl OpenSSLCrypto :: threadsCleanup (void)" (? ThreadsCleanup @ OpenSSLCrypto @@ YAXXZ)
      25> common.lib (ARC4.obj): error LNK2019: external symbol EVP_CIPHER_CTX_init unresolved referred to in the function "public: __cdecl ARC4 :: ARC4 (unsigned int)" (?? 0ARC4 @@ QEAA @ I @ Z)
      25> common.lib (HmacHash.obj): error LNK2019: unresolved HMAC_CTX_init external symbol referenced in the "struct hmac_ctx_st * __cdecl HMAC_CTX_new (void)" function (? HMAC_CTX_new @@ YAPEAUhmac_ctx_st @@ XZ)
      25> common.lib (HmacHash.obj): error LNK2019: unresolved HMAC_CTX_cleanup external symbol referenced in the "void __cdecl HMAC_CTX_free (struct hmac_ctx_st *)" function (? HMAC_CTX_free @@ YAXPEAUhmac_ctx_st @@@ Z)
      25> E: \ Server-Wow \ TrinityCore_434-4.3.4 \ Build \ bin \ RelWithDebInfo \ worldserver.exe: fatal error LNK1120: 16 external unresolved
      25> Compilation of the "worldserver.vcxproj" project completed - ERROR.
      26> ------ Compile operation started: project: ALL_BUILD, configuration: RelWithDebInfo x64 ------
      26> Building Custom Rule E: /Server-Wow/TrinityCore_434-4.3.4/CMakeLists.txt
      26> CMake does not need to re-run because E: /Server-Wow/TrinityCore_434-4.3.4/Build/CMakeFiles/generate.stamp is up-to-date.
      ========== Compile: 23 correct, 3 incorrect, 0 updated, 0 omitted ==========
       
      And this is the original error in Spanish (since I use the compiler in Spanish)
       
      Main.obj : error LNK2019: símbolo externo SSLeay_version sin resolver al que se hace referencia en la función "public: void __cdecl <lambda_4a2d53ce610f18dba0b4b4d6532c13a7>::operator()(void)const " (??R<lambda_4a2d53ce610f18dba0b4b4d6532c13a7>@@QEBAXXZ)
      25>scripts.lib(cs_server.obj) : error LNK2001: símbolo externo SSLeay_version sin resolver
      25>gsoap.lib(stdsoap2.obj) : error LNK2019: símbolo externo sk_num sin resolver al que se hace referencia en la función tcp_connect
      25>gsoap.lib(stdsoap2.obj) : error LNK2019: símbolo externo sk_value sin resolver al que se hace referencia en la función tcp_connect
      25>gsoap.lib(stdsoap2.obj) : error LNK2019: símbolo externo sk_pop_free sin resolver al que se hace referencia en la función tcp_connect
      25>gsoap.lib(stdsoap2.obj) : error LNK2019: símbolo externo OPENSSL_add_all_algorithms_noconf sin resolver al que se hace referencia en la función soap_ssl_init
      25>gsoap.lib(stdsoap2.obj) : error LNK2019: símbolo externo SSL_load_error_strings sin resolver al que se hace referencia en la función soap_ssl_init
      25>gsoap.lib(stdsoap2.obj) : error LNK2019: símbolo externo SSLv23_method sin resolver al que se hace referencia en la función ssl_auth_init
      25>gsoap.lib(stdsoap2.obj) : error LNK2019: símbolo externo SSL_library_init sin resolver al que se hace referencia en la función soap_ssl_init
      25>gsoap.lib(stdsoap2.obj) : error LNK2019: símbolo externo SSL_state sin resolver al que se hace referencia en la función tcp_connect
      25>common.lib(OpenSSLCrypto.obj) : error LNK2019: símbolo externo CRYPTO_num_locks sin resolver al que se hace referencia en la función "void __cdecl OpenSSLCrypto::threadsCleanup(void)" ([email protected]@@YAXXZ)
      25>common.lib(OpenSSLCrypto.obj) : error LNK2019: símbolo externo CRYPTO_set_locking_callback sin resolver al que se hace referencia en la función "void __cdecl OpenSSLCrypto::threadsCleanup(void)" ([email protected]@@YAXXZ)
      25>common.lib(OpenSSLCrypto.obj) : error LNK2019: símbolo externo CRYPTO_THREADID_set_numeric sin resolver al que se hace referencia en la función "void __cdecl threadIdCallback(struct crypto_threadid_st *)" ([email protected]@[email protected]@@Z)
      25>common.lib(OpenSSLCrypto.obj) : error LNK2019: símbolo externo CRYPTO_THREADID_set_callback sin resolver al que se hace referencia en la función "void __cdecl OpenSSLCrypto::threadsCleanup(void)" ([email protected]@@YAXXZ)
      25>common.lib(ARC4.obj) : error LNK2019: símbolo externo EVP_CIPHER_CTX_init sin resolver al que se hace referencia en la función "public: __cdecl ARC4::ARC4(unsigned int)" ([email protected]@[email protected]@Z)
      25>common.lib(HmacHash.obj) : error LNK2019: símbolo externo HMAC_CTX_init sin resolver al que se hace referencia en la función "struct hmac_ctx_st * __cdecl HMAC_CTX_new(void)" ([email protected]@[email protected]@XZ)
      25>common.lib(HmacHash.obj) : error LNK2019: símbolo externo HMAC_CTX_cleanup sin resolver al que se hace referencia en la función "void __cdecl HMAC_CTX_free(struct hmac_ctx_st *)" ([email protected]@[email protected]@@Z)
      25>E:\Server-Wow\TrinityCore_434-4.3.4\Build\bin\RelWithDebInfo\worldserver.exe : fatal error LNK1120: 16 externos sin resolver
      25>Compilación del proyecto "worldserver.vcxproj" terminada -- ERROR.
      26>------ Operación Compilar iniciada: proyecto: ALL_BUILD, configuración: RelWithDebInfo x64 ------
      26>Building Custom Rule E:/Server-Wow/TrinityCore_434-4.3.4/CMakeLists.txt
      26>CMake does not need to re-run because E:/Server-Wow/TrinityCore_434-4.3.4/Build/CMakeFiles/generate.stamp is up-to-date.
      ========== Compilar: 23 correctos, 3 incorrectos, 0 actualizados, 0 omitidos ==========
       
       
      Thanks.
×
×
  • Create New...