Search the Community

Showing results for tags 'error'.



More search options

  • Search By Tags

    Type tags separated by commas.
  • Search By Author

Content Type


Forums

  • General
    • Releases and Announcements
  • Help and Support
    • Help and Support
  • Offtopic
    • Trinitycore.org Website issues
    • Chillout Room

Found 12 results

  1. Edit By Aokromes: If you can't compile check that you meet requirements: https://trinitycore.atlassian.net/wiki/spaces/tc/pages/2130068/Requirements If you get SSE2 error use: -DCMAKE_C_FLAGS="-msse -msse2 -msse3" -DCMAKE_CXX_FLAGS="-msse -msse2 -msse3" If you get mysql libs error you miss MySQL development files These files are shipped with MySQL Server but to make it easier we packed the libs and include files for both 32 bits and 64 bits. Extract the files to a known location, e.g, C:/mysql_libs https://github.com/TrinityCore/TrinityCore/releases/download/TDB335.55/mysql_lib.zip If you get error 0xc000007b at start is that you are mixing 32 and 64 bits libraries.
  2. Hello, I just compiled latest TrinityCore from source on Debian (commit a834c66a4e637edfc1d271daf3c64468fb8c731f), run worldserver and bnetserver without error and correct configuration, patched client Wow.exe from Battle.net with connection_patcher, changed "portal" in Config.wtf. When I try to login with WoW_patched.exe, I get the message "You have been disconnected. (BLZ51901016)" I sniffed network packet from this executable and the binary does connect to my server. Thank you for helping !
  3. I followed the guide on how to install the core on Linux, but while configuring CMake I got this error: [email protected]:~/absolutely-hopeless-server/build$ cmake ../ -DCMAKE_INSTALL_PREFIX=/home/netherblood/server -DCONF_DIR=/home/netherblood/server/etc -DTOOLS=1 -DWITH_WARNINGS=1 -- Detected 64-bit platform -- UNIX: Using default library directory CMake Error at cmake/platform/unix/settings.cmake:14 (configure_file): configure_file attempted to configure a file: /home/netherblood/absolutely-hopeless-server/cmake_uninstall.cmake into a source directory. Call Stack (most recent call first): cmake/macros/CheckPlatform.cmake:13 (include) CMakeLists.txt:58 (include) -- Configuring incomplete, errors occurred! See also "/home/netherblood/absolutely-hopeless-server/CMakeFiles/CMakeOutput.log". [email protected]:~/absolutely-hopeless-server/build$ Attached is the log. CMakeOutput (1).log
  4. hi. i want to compile the core in Microsoft Visual Studio 2013, but i get rhis error: Warning 1 warning C4805: '==' : unsafe mix of type 'bool' and type 'uint16' in operation C:\test\source\source\src\server\game\Entities\Unit\Unit.cpp 15688 1 game Error 2 error C2903: 'result' : symbol is neither a class template nor a function template (C:\test\source\source\src\server\game\Entities\Taxi\TaxiPathGraph.cpp) C:\local\boost_1_55_0\boost\utility\result_of.hpp 186 1 game Error 3 error C2039: 'result' : is not a member of 'TaxiPathGraph::GetCompleteNodeRoute::<lambda_b66f1e4d2625bde789c6e1f8e8bffd24>' (C:\test\source\source\src\server\game\Entities\Taxi\TaxiPathGraph.cpp) C:\local\boost_1_55_0\boost\utility\result_of.hpp 186 1 game Error 4 error C2504: 'result' : base class undefined (C:\test\source\source\src\server\game\Entities\Taxi\TaxiPathGraph.cpp) C:\local\boost_1_55_0\boost\utility\result_of.hpp 186 1 game Error 5 error C2143: syntax error : missing ',' before '<' (C:\test\source\source\src\server\game\Entities\Taxi\TaxiPathGraph.cpp) C:\local\boost_1_55_0\boost\utility\result_of.hpp 186 1 game Error 6 error C2783: 'boost::transform_value_property_map<Func,PM,Ret> boost::make_transform_value_property_map(const Func &,const PM &)' : could not deduce template argument for 'Ret' C:\test\source\source\src\server\game\Entities\Taxi\TaxiPathGraph.cpp 156 1 game Error 7 error C2893: Failed to specialize function template 'boost::transform_value_property_map<Func,PM,boost::result_of<const Func(property_traits<PA>::reference)>::type> boost::make_transform_value_property_map(const Func &,const PM &)' C:\test\source\source\src\server\game\Entities\Taxi\TaxiPathGraph.cpp 156 1 game Error 8 error C2780: 'void boost::dijkstra_shortest_paths(const VertexListGraph &,graph_traits<G>::vertex_descriptor,const boost::bgl_named_params<T,Tag,Base> &)' : expects 3 arguments - 2 provided C:\test\source\source\src\server\game\Entities\Taxi\TaxiPathGraph.cpp 156 1 game Error 9 error C2780: 'void boost::dijkstra_shortest_paths(const VertexListGraph &,graph_traits<G>::vertex_descriptor,PredecessorMap,DistanceMap,WeightMap,IndexMap,Compare,Combine,DistInf,DistZero,DijkstraVisitor)' : expects 11 arguments - 2 provided C:\test\source\source\src\server\game\Entities\Taxi\TaxiPathGraph.cpp 156 1 game Error 10 error C2780: 'void boost::dijkstra_shortest_paths(const VertexListGraph &,SourceInputIter,SourceInputIter,PredecessorMap,DistanceMap,WeightMap,IndexMap,Compare,Combine,DistInf,DistZero,DijkstraVisitor)' : expects 12 arguments - 2 provided C:\test\source\source\src\server\game\Entities\Taxi\TaxiPathGraph.cpp 156 1 game Error 11 error C2780: 'void boost::dijkstra_shortest_paths(const VertexListGraph &,graph_traits<G>::vertex_descriptor,PredecessorMap,DistanceMap,WeightMap,IndexMap,Compare,Combine,DistInf,DistZero,DijkstraVisitor,ColorMap)' : expects 12 arguments - 2 provided C:\test\source\source\src\server\game\Entities\Taxi\TaxiPathGraph.cpp 156 1 game Error 12 error C2780: 'void boost::dijkstra_shortest_paths(const VertexListGraph &,SourceInputIter,SourceInputIter,PredecessorMap,DistanceMap,WeightMap,IndexMap,Compare,Combine,DistInf,DistZero,DijkstraVisitor,ColorMap)' : expects 13 arguments - 2 provided C:\test\source\source\src\server\game\Entities\Taxi\TaxiPathGraph.cpp 156 1 game Error 13 error C2780: 'void boost::dijkstra_shortest_paths(const VertexListGraph &,graph_traits<G>::vertex_descriptor,PredecessorMap,DistanceMap,WeightMap,IndexMap,Compare,Combine,DistInf,DistZero,DijkstraVisitor,const boost::bgl_named_params<T,Tag,Base> &,enable_if_c<(boost::is_base_and_derived<boost::vertex_list_graph_tag,boost::graph_traits<G>::traversal_category>::value,boost::graph::detail::no_parameter>::type)' : expects 13 arguments - 2 provided C:\test\source\source\src\server\game\Entities\Taxi\TaxiPathGraph.cpp 156 1 game Error 14 error C2780: 'void boost::dijkstra_shortest_paths(const VertexListGraph &,SourceInputIter,SourceInputIter,PredecessorMap,DistanceMap,WeightMap,IndexMap,Compare,Combine,DistInf,DistZero,DijkstraVisitor,const boost::bgl_named_params<T,Tag,Base> &,enable_if_c<(boost::is_base_and_derived<boost::vertex_list_graph_tag,boost::graph_traits<G>::traversal_category>::value,boost::graph::detail::no_parameter>::type)' : expects 14 arguments - 2 provided C:\test\source\source\src\server\game\Entities\Taxi\TaxiPathGraph.cpp 156 1 game Error 15 error LNK1181: cannot open input file '..\game\Release\game.lib' C:\test\build\src\server\worldserver\LINK worldserver error.txt
  5. Hello I'm trying to make newest Trinitycore branch 3.3.5. I'm building it on Ubuntu 15.01. I've did all steps as on Triniticore installation wiki. After 15% percent this happened can someone help me with it? I want to finally build Trinitycore after 2 days
  6. Hi guys. I'm getting this error on my linux machine when I try to start my authserver. /root/ElunaTrinityWotlk/src/server/database/Database/DatabaseWorkerPool.cpp:32 in DatabaseWorkerPool FATAL ERROR: Used MySQL library version (5.7.16) does not match the version used to compile TrinityCore (5.7.15). Search on forum for TCE00011. Segmentation fault (core dumped) I looked at the official TrinityCore solution. On Windows I know it's a dll thing, but on Linux apparently you have to recompile your core. So I updated mysql and re-pulled the source and then rebuilt and recompiled. Still the same issue. I believe it must be because when it compiles it somehow uses the 5.7.15 lib, but I don't know how to change that. I'm running really far behind schedule due to this issue so any help would be greatly appreciated.
  7. Hello everyone, I'm getting this error when I'm generating the build from cmake. I have installed all the software which were told here https://trinitycore.atlassian.net/wiki/display/tc/Windows+Requirements I am using win10 64bit. Also i have put an CmakeOutput.log Could someone guide me with this problem and what to do in order to be alower to generate the build of the source ? Thank you very much and have a nice day. Error 1.bmp Errors 2.bmp CMakeOutput.log
  8. Immediately apologize, I'm Russian and I use Google translation. When I compile the server it was on 97% and gives me the error: /usr/bin/ld: cannot find -lg3dlib collect2: error: ld returned 1 exit status make[2]: *** [src/server/worldserver/worldserver] Error 1 make[1]: *** [src/server/worldserver/CMakeFiles/worldserver.dir/all] Error 2 make: *** [all] Error 2 Tell me where do I find her? Since I already searched the Google.
  9. Hey there, I am trying to compile a fresh copy of 3.3.5 TC but it will not work. I have very little knowledge in this area and thus I am asking for help after trying to figure it out for 2 days. I am using Visual Studio 13 with update 5. I am have tried using boost 1.59 as well as 1.60 for visual studio 2013. I am running Windows 10. I have also tried compiling with Visual Studio 10 but same problem. Basically I clone the latest revision, run it through cMake, configure, generate and so on, and that part works just fine, the problem is the actual compiling. All the programs I have been using are for 32 bit systems although I run 64 bit. The error list is very long and most of the time it's the same one several times, but in different parts of the process. My question is how do I fix this issue? Error 1 error C2039: '_abs64' : is not a member of '`global namespace'' C:\Program Files (x86)\Microsoft Visual Studio 12.0\VC\include\cinttypes 22 1 game Error 2 error C2873: '_abs64' : symbol cannot be used in a using-declaration C:\Program Files (x86)\Microsoft Visual Studio 12.0\VC\include\cinttypes 22 1 game Error 3 error C2039: '_strtoi64' : is not a member of '`global namespace'' C:\Program Files (x86)\Microsoft Visual Studio 12.0\VC\include\cinttypes 23 1 game Error 4 error C2873: '_strtoi64' : symbol cannot be used in a using-declaration C:\Program Files (x86)\Microsoft Visual Studio 12.0\VC\include\cinttypes 23 1 game Error 5 error C2039: '_strtoui64' : is not a member of '`global namespace'' C:\Program Files (x86)\Microsoft Visual Studio 12.0\VC\include\cinttypes 23 1 game Error 6 error C2873: '_strtoui64' : symbol cannot be used in a using-declaration C:\Program Files (x86)\Microsoft Visual Studio 12.0\VC\include\cinttypes 23 1 game Error 7 error C2039: '_abs64' : is not a member of '`global namespace'' C:\Program Files (x86)\Microsoft Visual Studio 12.0\VC\include\cinttypes 22 1 common Error 8 error C2873: '_abs64' : symbol cannot be used in a using-declaration C:\Program Files (x86)\Microsoft Visual Studio 12.0\VC\include\cinttypes 22 1 common Error 9 error C2039: '_strtoi64' : is not a member of '`global namespace'' C:\Program Files (x86)\Microsoft Visual Studio 12.0\VC\include\cinttypes 23 1 common Error 10 error C2873: '_strtoi64' : symbol cannot be used in a using-declaration C:\Program Files (x86)\Microsoft Visual Studio 12.0\VC\include\cinttypes 23 1 common Error 11 error C2039: '_strtoui64' : is not a member of '`global namespace'' C:\Program Files (x86)\Microsoft Visual Studio 12.0\VC\include\cinttypes 23 1 common Error 12 error C2873: '_strtoui64' : symbol cannot be used in a using-declaration C:\Program Files (x86)\Microsoft Visual Studio 12.0\VC\include\cinttypes 23 1 common Error 13 error C2065: 'INTMAX_MAX' : undeclared identifier C:\Program Files (x86)\Microsoft Visual Studio 12.0\VC\include\ratio 122 1 game Error 14 error C2065: 'INTMAX_MAX' : undeclared identifier C:\Program Files (x86)\Microsoft Visual Studio 12.0\VC\include\ratio 124 1 game Error 15 error C2065: 'INTMAX_MAX' : undeclared identifier C:\Program Files (x86)\Microsoft Visual Studio 12.0\VC\include\ratio 44 1 game Error 16 error C2338: integer arithmetic overflow C:\Program Files (x86)\Microsoft Visual Studio 12.0\VC\include\ratio 36 1 game Error 17 error C2039: 'value' : is not a member of 'std::_Safe_multX<0x01,0x01,false>' C:\Program Files (x86)\Microsoft Visual Studio 12.0\VC\include\ratio 44 1 game Error 18 error C2065: 'value' : undeclared identifier C:\Program Files (x86)\Microsoft Visual Studio 12.0\VC\include\ratio 44 1 game Error 19 error C2057: expected constant expression C:\Program Files (x86)\Microsoft Visual Studio 12.0\VC\include\ratio 44 1 game Error 20 error C2039: 'value' : is not a member of 'std::_Safe_multX<0x01,0x0989680,false>' C:\Program Files (x86)\Microsoft Visual Studio 12.0\VC\include\ratio 44 1 game Error 21 error C2975: '_Nx' : invalid template argument for 'std::ratio', expected compile-time constant expression C:\Program Files (x86)\Microsoft Visual Studio 12.0\VC\include\ratio 219 1 game Error 22 error C2975: '_Dx' : invalid template argument for 'std::ratio', expected compile-time constant expression C:\Program Files (x86)\Microsoft Visual Studio 12.0\VC\include\ratio 219 1 game Error 23 error C2065: 'INTMAX_MAX' : undeclared identifier C:\Program Files (x86)\Microsoft Visual Studio 12.0\VC\include\ratio 122 1 database Error 24 error C2065: 'INTMAX_MAX' : undeclared identifier C:\Program Files (x86)\Microsoft Visual Studio 12.0\VC\include\ratio 124 1 database Error 25 error C2065: 'INTMAX_MAX' : undeclared identifier C:\Program Files (x86)\Microsoft Visual Studio 12.0\VC\include\ratio 44 1 database Error 26 error C2338: integer arithmetic overflow C:\Program Files (x86)\Microsoft Visual Studio 12.0\VC\include\ratio 36 1 database Error 27 error C2039: 'value' : is not a member of 'std::_Safe_multX<0x01,0x01,false>' C:\Program Files (x86)\Microsoft Visual Studio 12.0\VC\include\ratio 44 1 database Error 28 error C2065: 'value' : undeclared identifier C:\Program Files (x86)\Microsoft Visual Studio 12.0\VC\include\ratio 44 1 database Error 29 error C2057: expected constant expression C:\Program Files (x86)\Microsoft Visual Studio 12.0\VC\include\ratio 44 1 database Error 30 error C2039: 'value' : is not a member of 'std::_Safe_multX<0x01,0x0989680,false>' C:\Program Files (x86)\Microsoft Visual Studio 12.0\VC\include\ratio 44 1 database Error 31 error C2975: '_Nx' : invalid template argument for 'std::ratio', expected compile-time constant expression C:\Program Files (x86)\Microsoft Visual Studio 12.0\VC\include\ratio 219 1 database Error 32 error C2975: '_Dx' : invalid template argument for 'std::ratio', expected compile-time constant expression C:\Program Files (x86)\Microsoft Visual Studio 12.0\VC\include\ratio 219 1 database Error 33 error C2065: 'INTMAX_MAX' : undeclared identifier C:\Program Files (x86)\Microsoft Visual Studio 12.0\VC\include\ratio 122 1 common Error 34 error C2065: 'INTMAX_MAX' : undeclared identifier C:\Program Files (x86)\Microsoft Visual Studio 12.0\VC\include\ratio 124 1 common Error 35 error C2065: 'INTMAX_MAX' : undeclared identifier C:\Program Files (x86)\Microsoft Visual Studio 12.0\VC\include\ratio 44 1 common Error 36 error C2338: integer arithmetic overflow C:\Program Files (x86)\Microsoft Visual Studio 12.0\VC\include\ratio 36 1 common Error 37 error C2039: 'value' : is not a member of 'std::_Safe_multX<0x01,0x01,false>' C:\Program Files (x86)\Microsoft Visual Studio 12.0\VC\include\ratio 44 1 common Error 38 error C2065: 'value' : undeclared identifier C:\Program Files (x86)\Microsoft Visual Studio 12.0\VC\include\ratio 44 1 common Error 39 error C2057: expected constant expression C:\Program Files (x86)\Microsoft Visual Studio 12.0\VC\include\ratio 44 1 common Error 40 error C2039: 'value' : is not a member of 'std::_Safe_multX<0x01,0x0989680,false>' C:\Program Files (x86)\Microsoft Visual Studio 12.0\VC\include\ratio 44 1 common Error 41 error C2975: '_Nx' : invalid template argument for 'std::ratio', expected compile-time constant expression C:\Program Files (x86)\Microsoft Visual Studio 12.0\VC\include\ratio 219 1 common Error 42 error C2975: '_Dx' : invalid template argument for 'std::ratio', expected compile-time constant expression C:\Program Files (x86)\Microsoft Visual Studio 12.0\VC\include\ratio 219 1 common Error 43 error C2338: zero denominator C:\Program Files (x86)\Microsoft Visual Studio 12.0\VC\include\ratio 121 1 game Error 44 error C2039: '_abs64' : is not a member of '`global namespace'' C:\Program Files (x86)\Microsoft Visual Studio 12.0\VC\include\cinttypes 22 1 scripts Error 45 error C2873: '_abs64' : symbol cannot be used in a using-declaration C:\Program Files (x86)\Microsoft Visual Studio 12.0\VC\include\cinttypes 22 1 scripts Error 46 error C2039: '_strtoi64' : is not a member of '`global namespace'' C:\Program Files (x86)\Microsoft Visual Studio 12.0\VC\include\cinttypes 23 1 scripts Error 47 error C2873: '_strtoi64' : symbol cannot be used in a using-declaration C:\Program Files (x86)\Microsoft Visual Studio 12.0\VC\include\cinttypes 23 1 scripts Error 48 error C2039: '_strtoui64' : is not a member of '`global namespace'' C:\Program Files (x86)\Microsoft Visual Studio 12.0\VC\include\cinttypes 23 1 scripts Error 49 error C2873: '_strtoui64' : symbol cannot be used in a using-declaration C:\Program Files (x86)\Microsoft Visual Studio 12.0\VC\include\cinttypes 23 1 scripts Error 50 error C2065: 'INTMAX_MAX' : undeclared identifier C:\Program Files (x86)\Microsoft Visual Studio 12.0\VC\include\ratio 122 1 scripts Error 51 error C2065: 'INTMAX_MAX' : undeclared identifier C:\Program Files (x86)\Microsoft Visual Studio 12.0\VC\include\ratio 124 1 scripts Error 52 error C2065: 'INTMAX_MAX' : undeclared identifier C:\Program Files (x86)\Microsoft Visual Studio 12.0\VC\include\ratio 44 1 scripts Error 53 error C2338: integer arithmetic overflow C:\Program Files (x86)\Microsoft Visual Studio 12.0\VC\include\ratio 36 1 scripts Error 54 error C2039: 'value' : is not a member of 'std::_Safe_multX<0x01,0x01,false>' C:\Program Files (x86)\Microsoft Visual Studio 12.0\VC\include\ratio 44 1 scripts Error 55 error C2065: 'value' : undeclared identifier C:\Program Files (x86)\Microsoft Visual Studio 12.0\VC\include\ratio 44 1 scripts Error 56 error C2057: expected constant expression C:\Program Files (x86)\Microsoft Visual Studio 12.0\VC\include\ratio 44 1 scripts Error 57 error C2039: 'value' : is not a member of 'std::_Safe_multX<0x01,0x0989680,false>' C:\Program Files (x86)\Microsoft Visual Studio 12.0\VC\include\ratio 44 1 scripts Error 58 error C2975: '_Nx' : invalid template argument for 'std::ratio', expected compile-time constant expression C:\Program Files (x86)\Microsoft Visual Studio 12.0\VC\include\ratio 219 1 scripts Error 59 error C2975: '_Dx' : invalid template argument for 'std::ratio', expected compile-time constant expression C:\Program Files (x86)\Microsoft Visual Studio 12.0\VC\include\ratio 219 1 scripts Error 60 error C2065: 'INTMAX_MAX' : undeclared identifier (C:\Users\Kenny\Desktop\1\src\server\shared\Cryptography\OpenSSLCrypto.cpp) C:\Program Files (x86)\Microsoft Visual Studio 12.0\VC\include\ratio 122 1 shared Error 61 error C2065: 'INTMAX_MAX' : undeclared identifier (C:\Users\Kenny\Desktop\1\src\server\shared\Cryptography\OpenSSLCrypto.cpp) C:\Program Files (x86)\Microsoft Visual Studio 12.0\VC\include\ratio 124 1 shared Error 62 error C2065: 'INTMAX_MAX' : undeclared identifier (C:\Users\Kenny\Desktop\1\src\server\shared\Cryptography\OpenSSLCrypto.cpp) C:\Program Files (x86)\Microsoft Visual Studio 12.0\VC\include\ratio 44 1 shared Error 63 error C2338: integer arithmetic overflow (C:\Users\Kenny\Desktop\1\src\server\shared\Cryptography\OpenSSLCrypto.cpp) C:\Program Files (x86)\Microsoft Visual Studio 12.0\VC\include\ratio 36 1 shared Error 64 error C2039: 'value' : is not a member of 'std::_Safe_multX<0x01,0x01,false>' (C:\Users\Kenny\Desktop\1\src\server\shared\Cryptography\OpenSSLCrypto.cpp) C:\Program Files (x86)\Microsoft Visual Studio 12.0\VC\include\ratio 44 1 shared Error 65 error C2065: 'value' : undeclared identifier (C:\Users\Kenny\Desktop\1\src\server\shared\Cryptography\OpenSSLCrypto.cpp) C:\Program Files (x86)\Microsoft Visual Studio 12.0\VC\include\ratio 44 1 shared Error 66 error C2057: expected constant expression (C:\Users\Kenny\Desktop\1\src\server\shared\Cryptography\OpenSSLCrypto.cpp) C:\Program Files (x86)\Microsoft Visual Studio 12.0\VC\include\ratio 44 1 shared Error 67 error C2039: 'value' : is not a member of 'std::_Safe_multX<0x01,0x0989680,false>' (C:\Users\Kenny\Desktop\1\src\server\shared\Cryptography\OpenSSLCrypto.cpp) C:\Program Files (x86)\Microsoft Visual Studio 12.0\VC\include\ratio 44 1 shared Error 68 error C2975: '_Nx' : invalid template argument for 'std::ratio', expected compile-time constant expression (C:\Users\Kenny\Desktop\1\src\server\shared\Cryptography\OpenSSLCrypto.cpp) C:\Program Files (x86)\Microsoft Visual Studio 12.0\VC\include\ratio 219 1 shared Error 69 error C2975: '_Dx' : invalid template argument for 'std::ratio', expected compile-time constant expression (C:\Users\Kenny\Desktop\1\src\server\shared\Cryptography\OpenSSLCrypto.cpp) C:\Program Files (x86)\Microsoft Visual Studio 12.0\VC\include\ratio 219 1 shared Error 70 error C2065: 'INTMAX_MAX' : undeclared identifier (C:\Users\Kenny\Desktop\1\src\server\shared\Service\ServiceWin32.cpp) C:\Program Files (x86)\Microsoft Visual Studio 12.0\VC\include\ratio 122 1 shared Error 71 error C2065: 'INTMAX_MAX' : undeclared identifier (C:\Users\Kenny\Desktop\1\src\server\shared\Service\ServiceWin32.cpp) C:\Program Files (x86)\Microsoft Visual Studio 12.0\VC\include\ratio 124 1 shared Error 72 error C2065: 'INTMAX_MAX' : undeclared identifier (C:\Users\Kenny\Desktop\1\src\server\shared\Service\ServiceWin32.cpp) C:\Program Files (x86)\Microsoft Visual Studio 12.0\VC\include\ratio 44 1 shared Error 73 error C2338: integer arithmetic overflow (C:\Users\Kenny\Desktop\1\src\server\shared\Service\ServiceWin32.cpp) C:\Program Files (x86)\Microsoft Visual Studio 12.0\VC\include\ratio 36 1 shared Error 74 error C2039: 'value' : is not a member of 'std::_Safe_multX<0x01,0x01,false>' (C:\Users\Kenny\Desktop\1\src\server\shared\Service\ServiceWin32.cpp) C:\Program Files (x86)\Microsoft Visual Studio 12.0\VC\include\ratio 44 1 shared Error 75 error C2065: 'value' : undeclared identifier (C:\Users\Kenny\Desktop\1\src\server\shared\Service\ServiceWin32.cpp) C:\Program Files (x86)\Microsoft Visual Studio 12.0\VC\include\ratio 44 1 shared Error 76 error C2057: expected constant expression (C:\Users\Kenny\Desktop\1\src\server\shared\Service\ServiceWin32.cpp) C:\Program Files (x86)\Microsoft Visual Studio 12.0\VC\include\ratio 44 1 shared Error 77 error C2039: 'value' : is not a member of 'std::_Safe_multX<0x01,0x0989680,false>' (C:\Users\Kenny\Desktop\1\src\server\shared\Service\ServiceWin32.cpp) C:\Program Files (x86)\Microsoft Visual Studio 12.0\VC\include\ratio 44 1 shared Error 78 error C2975: '_Nx' : invalid template argument for 'std::ratio', expected compile-time constant expression (C:\Users\Kenny\Desktop\1\src\server\shared\Service\ServiceWin32.cpp) C:\Program Files (x86)\Microsoft Visual Studio 12.0\VC\include\ratio 219 1 shared Error 79 error C2975: '_Dx' : invalid template argument for 'std::ratio', expected compile-time constant expression (C:\Users\Kenny\Desktop\1\src\server\shared\Service\ServiceWin32.cpp) C:\Program Files (x86)\Microsoft Visual Studio 12.0\VC\include\ratio 219 1 shared Error 80 error C2065: 'INTMAX_MAX' : undeclared identifier (C:\Users\Kenny\Desktop\1\src\server\shared\Packets\ByteBuffer.cpp) C:\Program Files (x86)\Microsoft Visual Studio 12.0\VC\include\ratio 122 1 shared Error 81 error C2065: 'INTMAX_MAX' : undeclared identifier (C:\Users\Kenny\Desktop\1\src\server\shared\Packets\ByteBuffer.cpp) C:\Program Files (x86)\Microsoft Visual Studio 12.0\VC\include\ratio 124 1 shared Error 82 error C2065: 'INTMAX_MAX' : undeclared identifier (C:\Users\Kenny\Desktop\1\src\server\shared\Packets\ByteBuffer.cpp) C:\Program Files (x86)\Microsoft Visual Studio 12.0\VC\include\ratio 44 1 shared Error 83 error C2338: integer arithmetic overflow (C:\Users\Kenny\Desktop\1\src\server\shared\Packets\ByteBuffer.cpp) C:\Program Files (x86)\Microsoft Visual Studio 12.0\VC\include\ratio 36 1 shared Error 84 error C2039: 'value' : is not a member of 'std::_Safe_multX<0x01,0x01,false>' (C:\Users\Kenny\Desktop\1\src\server\shared\Packets\ByteBuffer.cpp) C:\Program Files (x86)\Microsoft Visual Studio 12.0\VC\include\ratio 44 1 shared Error 85 error C2065: 'value' : undeclared identifier (C:\Users\Kenny\Desktop\1\src\server\shared\Packets\ByteBuffer.cpp) C:\Program Files (x86)\Microsoft Visual Studio 12.0\VC\include\ratio 44 1 shared Error 86 error C2057: expected constant expression (C:\Users\Kenny\Desktop\1\src\server\shared\Packets\ByteBuffer.cpp) C:\Program Files (x86)\Microsoft Visual Studio 12.0\VC\include\ratio 44 1 shared Error 87 error C2039: 'value' : is not a member of 'std::_Safe_multX<0x01,0x0989680,false>' (C:\Users\Kenny\Desktop\1\src\server\shared\Packets\ByteBuffer.cpp) C:\Program Files (x86)\Microsoft Visual Studio 12.0\VC\include\ratio 44 1 shared Error 88 error C2975: '_Nx' : invalid template argument for 'std::ratio', expected compile-time constant expression (C:\Users\Kenny\Desktop\1\src\server\shared\Packets\ByteBuffer.cpp) C:\Program Files (x86)\Microsoft Visual Studio 12.0\VC\include\ratio 219 1 shared Error 89 error C2975: '_Dx' : invalid template argument for 'std::ratio', expected compile-time constant expression (C:\Users\Kenny\Desktop\1\src\server\shared\Packets\ByteBuffer.cpp) C:\Program Files (x86)\Microsoft Visual Studio 12.0\VC\include\ratio 219 1 shared Error 90 error C2065: 'INTMAX_MAX' : undeclared identifier (C:\Users\Kenny\Desktop\1\src\server\shared\Cryptography\HMACSHA1.cpp) C:\Program Files (x86)\Microsoft Visual Studio 12.0\VC\include\ratio 122 1 shared Error 91 error C2065: 'INTMAX_MAX' : undeclared identifier (C:\Users\Kenny\Desktop\1\src\server\shared\Cryptography\HMACSHA1.cpp) C:\Program Files (x86)\Microsoft Visual Studio 12.0\VC\include\ratio 124 1 shared Error 92 error C2065: 'INTMAX_MAX' : undeclared identifier (C:\Users\Kenny\Desktop\1\src\server\shared\Cryptography\HMACSHA1.cpp) C:\Program Files (x86)\Microsoft Visual Studio 12.0\VC\include\ratio 44 1 shared Error 93 error C2338: integer arithmetic overflow (C:\Users\Kenny\Desktop\1\src\server\shared\Cryptography\HMACSHA1.cpp) C:\Program Files (x86)\Microsoft Visual Studio 12.0\VC\include\ratio 36 1 shared Error 94 error C2039: 'value' : is not a member of 'std::_Safe_multX<0x01,0x01,false>' (C:\Users\Kenny\Desktop\1\src\server\shared\Cryptography\HMACSHA1.cpp) C:\Program Files (x86)\Microsoft Visual Studio 12.0\VC\include\ratio 44 1 shared Error 95 error C2065: 'value' : undeclared identifier (C:\Users\Kenny\Desktop\1\src\server\shared\Cryptography\HMACSHA1.cpp) C:\Program Files (x86)\Microsoft Visual Studio 12.0\VC\include\ratio 44 1 shared Error 96 error C2057: expected constant expression (C:\Users\Kenny\Desktop\1\src\server\shared\Cryptography\HMACSHA1.cpp) C:\Program Files (x86)\Microsoft Visual Studio 12.0\VC\include\ratio 44 1 shared Error 97 error C2039: 'value' : is not a member of 'std::_Safe_multX<0x01,0x0989680,false>' (C:\Users\Kenny\Desktop\1\src\server\shared\Cryptography\HMACSHA1.cpp) C:\Program Files (x86)\Microsoft Visual Studio 12.0\VC\include\ratio 44 1 shared Error 98 error C2975: '_Nx' : invalid template argument for 'std::ratio', expected compile-time constant expression (C:\Users\Kenny\Desktop\1\src\server\shared\Cryptography\HMACSHA1.cpp) C:\Program Files (x86)\Microsoft Visual Studio 12.0\VC\include\ratio 219 1 shared Error 99 error C2975: '_Dx' : invalid template argument for 'std::ratio', expected compile-time constant expression (C:\Users\Kenny\Desktop\1\src\server\shared\Cryptography\HMACSHA1.cpp) C:\Program Files (x86)\Microsoft Visual Studio 12.0\VC\include\ratio 219 1 shared Error 100 error C2065: 'INTMAX_MAX' : undeclared identifier (C:\Users\Kenny\Desktop\1\src\tools\mmaps_generator\TerrainBuilder.cpp) C:\Program Files (x86)\Microsoft Visual Studio 12.0\VC\include\ratio 122 1 mmaps_generator Error 101 error C2065: 'INTMAX_MAX' : undeclared identifier (C:\Users\Kenny\Desktop\1\src\tools\mmaps_generator\TerrainBuilder.cpp) C:\Program Files (x86)\Microsoft Visual Studio 12.0\VC\include\ratio 124 1 mmaps_generator Error 102 error C2065: 'INTMAX_MAX' : undeclared identifier (C:\Users\Kenny\Desktop\1\src\tools\mmaps_generator\TerrainBuilder.cpp) C:\Program Files (x86)\Microsoft Visual Studio 12.0\VC\include\ratio 44 1 mmaps_generator Error 103 error C2338: integer arithmetic overflow (C:\Users\Kenny\Desktop\1\src\tools\mmaps_generator\TerrainBuilder.cpp) C:\Program Files (x86)\Microsoft Visual Studio 12.0\VC\include\ratio 36 1 mmaps_generator Error 104 error C2039: 'value' : is not a member of 'std::_Safe_multX<0x01,0x01,false>' (C:\Users\Kenny\Desktop\1\src\tools\mmaps_generator\TerrainBuilder.cpp) C:\Program Files (x86)\Microsoft Visual Studio 12.0\VC\include\ratio 44 1 mmaps_generator Error 105 error C2065: 'value' : undeclared identifier (C:\Users\Kenny\Desktop\1\src\tools\mmaps_generator\TerrainBuilder.cpp) C:\Program Files (x86)\Microsoft Visual Studio 12.0\VC\include\ratio 44 1 mmaps_generator Error 106 error C2057: expected constant expression (C:\Users\Kenny\Desktop\1\src\tools\mmaps_generator\TerrainBuilder.cpp) C:\Program Files (x86)\Microsoft Visual Studio 12.0\VC\include\ratio 44 1 mmaps_generator Error 107 error C2039: 'value' : is not a member of 'std::_Safe_multX<0x01,0x0989680,false>' (C:\Users\Kenny\Desktop\1\src\tools\mmaps_generator\TerrainBuilder.cpp) C:\Program Files (x86)\Microsoft Visual Studio 12.0\VC\include\ratio 44 1 mmaps_generator Error 108 error C2975: '_Nx' : invalid template argument for 'std::ratio', expected compile-time constant expression (C:\Users\Kenny\Desktop\1\src\tools\mmaps_generator\TerrainBuilder.cpp) C:\Program Files (x86)\Microsoft Visual Studio 12.0\VC\include\ratio 219 1 mmaps_generator Error 109 error C2975: '_Dx' : invalid template argument for 'std::ratio', expected compile-time constant expression (C:\Users\Kenny\Desktop\1\src\tools\mmaps_generator\TerrainBuilder.cpp) C:\Program Files (x86)\Microsoft Visual Studio 12.0\VC\include\ratio 219 1 mmaps_generator Error 110 error C2065: 'INTMAX_MAX' : undeclared identifier (C:\Users\Kenny\Desktop\1\src\tools\mmaps_generator\MapBuilder.cpp) C:\Program Files (x86)\Microsoft Visual Studio 12.0\VC\include\ratio 122 1 mmaps_generator Error 111 error C2065: 'INTMAX_MAX' : undeclared identifier (C:\Users\Kenny\Desktop\1\src\tools\mmaps_generator\MapBuilder.cpp) C:\Program Files (x86)\Microsoft Visual Studio 12.0\VC\include\ratio 124 1 mmaps_generator Error 112 error C2065: 'INTMAX_MAX' : undeclared identifier (C:\Users\Kenny\Desktop\1\src\tools\mmaps_generator\PathGenerator.cpp) C:\Program Files (x86)\Microsoft Visual Studio 12.0\VC\include\ratio 122 1 mmaps_generator Error 113 error C2065: 'INTMAX_MAX' : undeclared identifier (C:\Users\Kenny\Desktop\1\src\tools\mmaps_generator\PathGenerator.cpp) C:\Program Files (x86)\Microsoft Visual Studio 12.0\VC\include\ratio 124 1 mmaps_generator Error 114 error C2065: 'INTMAX_MAX' : undeclared identifier (C:\Users\Kenny\Desktop\1\src\tools\mmaps_generator\MapBuilder.cpp) C:\Program Files (x86)\Microsoft Visual Studio 12.0\VC\include\ratio 44 1 mmaps_generator Error 115 error C2338: integer arithmetic overflow (C:\Users\Kenny\Desktop\1\src\tools\mmaps_generator\MapBuilder.cpp) C:\Program Files (x86)\Microsoft Visual Studio 12.0\VC\include\ratio 36 1 mmaps_generator Error 116 error C2039: 'value' : is not a member of 'std::_Safe_multX<0x01,0x01,false>' (C:\Users\Kenny\Desktop\1\src\tools\mmaps_generator\MapBuilder.cpp) C:\Program Files (x86)\Microsoft Visual Studio 12.0\VC\include\ratio 44 1 mmaps_generator Error 117 error C2065: 'value' : undeclared identifier (C:\Users\Kenny\Desktop\1\src\tools\mmaps_generator\MapBuilder.cpp) C:\Program Files (x86)\Microsoft Visual Studio 12.0\VC\include\ratio 44 1 mmaps_generator Error 118 error C2057: expected constant expression (C:\Users\Kenny\Desktop\1\src\tools\mmaps_generator\MapBuilder.cpp) C:\Program Files (x86)\Microsoft Visual Studio 12.0\VC\include\ratio 44 1 mmaps_generator Error 119 error C2039: 'value' : is not a member of 'std::_Safe_multX<0x01,0x0989680,false>' (C:\Users\Kenny\Desktop\1\src\tools\mmaps_generator\MapBuilder.cpp) C:\Program Files (x86)\Microsoft Visual Studio 12.0\VC\include\ratio 44 1 mmaps_generator Error 120 error C2975: '_Nx' : invalid template argument for 'std::ratio', expected compile-time constant expression (C:\Users\Kenny\Desktop\1\src\tools\mmaps_generator\MapBuilder.cpp) C:\Program Files (x86)\Microsoft Visual Studio 12.0\VC\include\ratio 219 1 mmaps_generator Error 121 error C2975: '_Dx' : invalid template argument for 'std::ratio', expected compile-time constant expression (C:\Users\Kenny\Desktop\1\src\tools\mmaps_generator\MapBuilder.cpp) C:\Program Files (x86)\Microsoft Visual Studio 12.0\VC\include\ratio 219 1 mmaps_generator Error 122 error C2065: 'INTMAX_MAX' : undeclared identifier (C:\Users\Kenny\Desktop\1\src\tools\mmaps_generator\IntermediateValues.cpp) C:\Program Files (x86)\Microsoft Visual Studio 12.0\VC\include\ratio 122 1 mmaps_generator Error 123 error C2065: 'INTMAX_MAX' : undeclared identifier (C:\Users\Kenny\Desktop\1\src\tools\mmaps_generator\IntermediateValues.cpp) C:\Program Files (x86)\Microsoft Visual Studio 12.0\VC\include\ratio 124 1 mmaps_generator Error 124 error C2065: 'INTMAX_MAX' : undeclared identifier (C:\Users\Kenny\Desktop\1\src\tools\mmaps_generator\PathGenerator.cpp) C:\Program Files (x86)\Microsoft Visual Studio 12.0\VC\include\ratio 44 1 mmaps_generator Error 125 error C2338: integer arithmetic overflow (C:\Users\Kenny\Desktop\1\src\tools\mmaps_generator\PathGenerator.cpp) C:\Program Files (x86)\Microsoft Visual Studio 12.0\VC\include\ratio 36 1 mmaps_generator Error 126 error C2039: 'value' : is not a member of 'std::_Safe_multX<0x01,0x01,false>' (C:\Users\Kenny\Desktop\1\src\tools\mmaps_generator\PathGenerator.cpp) C:\Program Files (x86)\Microsoft Visual Studio 12.0\VC\include\ratio 44 1 mmaps_generator Error 127 error C2065: 'value' : undeclared identifier (C:\Users\Kenny\Desktop\1\src\tools\mmaps_generator\PathGenerator.cpp) C:\Program Files (x86)\Microsoft Visual Studio 12.0\VC\include\ratio 44 1 mmaps_generator Error 128 error C2057: expected constant expression (C:\Users\Kenny\Desktop\1\src\tools\mmaps_generator\PathGenerator.cpp) C:\Program Files (x86)\Microsoft Visual Studio 12.0\VC\include\ratio 44 1 mmaps_generator Error 129 error C2039: 'value' : is not a member of 'std::_Safe_multX<0x01,0x0989680,false>' (C:\Users\Kenny\Desktop\1\src\tools\mmaps_generator\PathGenerator.cpp) C:\Program Files (x86)\Microsoft Visual Studio 12.0\VC\include\ratio 44 1 mmaps_generator Error 130 error C2975: '_Nx' : invalid template argument for 'std::ratio', expected compile-time constant expression (C:\Users\Kenny\Desktop\1\src\tools\mmaps_generator\PathGenerator.cpp) C:\Program Files (x86)\Microsoft Visual Studio 12.0\VC\include\ratio 219 1 mmaps_generator Error 131 error C2975: '_Dx' : invalid template argument for 'std::ratio', expected compile-time constant expression (C:\Users\Kenny\Desktop\1\src\tools\mmaps_generator\PathGenerator.cpp) C:\Program Files (x86)\Microsoft Visual Studio 12.0\VC\include\ratio 219 1 mmaps_generator Error 132 error C2065: 'INTMAX_MAX' : undeclared identifier (C:\Users\Kenny\Desktop\1\src\tools\mmaps_generator\IntermediateValues.cpp) C:\Program Files (x86)\Microsoft Visual Studio 12.0\VC\include\ratio 44 1 mmaps_generator Error 133 error C2338: integer arithmetic overflow (C:\Users\Kenny\Desktop\1\src\tools\mmaps_generator\IntermediateValues.cpp) C:\Program Files (x86)\Microsoft Visual Studio 12.0\VC\include\ratio 36 1 mmaps_generator Error 134 error C2039: 'value' : is not a member of 'std::_Safe_multX<0x01,0x01,false>' (C:\Users\Kenny\Desktop\1\src\tools\mmaps_generator\IntermediateValues.cpp) C:\Program Files (x86)\Microsoft Visual Studio 12.0\VC\include\ratio 44 1 mmaps_generator Error 135 error C2065: 'value' : undeclared identifier (C:\Users\Kenny\Desktop\1\src\tools\mmaps_generator\IntermediateValues.cpp) C:\Program Files (x86)\Microsoft Visual Studio 12.0\VC\include\ratio 44 1 mmaps_generator Error 136 error C2057: expected constant expression (C:\Users\Kenny\Desktop\1\src\tools\mmaps_generator\IntermediateValues.cpp) C:\Program Files (x86)\Microsoft Visual Studio 12.0\VC\include\ratio 44 1 mmaps_generator Error 137 error C2039: 'value' : is not a member of 'std::_Safe_multX<0x01,0x0989680,false>' (C:\Users\Kenny\Desktop\1\src\tools\mmaps_generator\IntermediateValues.cpp) C:\Program Files (x86)\Microsoft Visual Studio 12.0\VC\include\ratio 44 1 mmaps_generator Error 138 error C2975: '_Nx' : invalid template argument for 'std::ratio', expected compile-time constant expression (C:\Users\Kenny\Desktop\1\src\tools\mmaps_generator\IntermediateValues.cpp) C:\Program Files (x86)\Microsoft Visual Studio 12.0\VC\include\ratio 219 1 mmaps_generator Error 139 error C2975: '_Dx' : invalid template argument for 'std::ratio', expected compile-time constant expression (C:\Users\Kenny\Desktop\1\src\tools\mmaps_generator\IntermediateValues.cpp) C:\Program Files (x86)\Microsoft Visual Studio 12.0\VC\include\ratio 219 1 mmaps_generator Error 140 error C2338: zero denominator (C:\Users\Kenny\Desktop\1\src\tools\mmaps_generator\PathGenerator.cpp) C:\Program Files (x86)\Microsoft Visual Studio 12.0\VC\include\ratio 121 1 mmaps_generator Error 141 error C2065: 'INTMAX_MAX' : undeclared identifier (C:\Users\Kenny\Desktop\1\src\tools\mmaps_generator\VMapExtensions.cpp) C:\Program Files (x86)\Microsoft Visual Studio 12.0\VC\include\ratio 122 1 mmaps_generator Error 142 error C2065: 'INTMAX_MAX' : undeclared identifier (C:\Users\Kenny\Desktop\1\src\tools\mmaps_generator\VMapExtensions.cpp) C:\Program Files (x86)\Microsoft Visual Studio 12.0\VC\include\ratio 124 1 mmaps_generator Error 143 error C2065: 'INTMAX_MAX' : undeclared identifier (C:\Users\Kenny\Desktop\1\src\tools\mmaps_generator\VMapExtensions.cpp) C:\Program Files (x86)\Microsoft Visual Studio 12.0\VC\include\ratio 44 1 mmaps_generator Error 144 error C2338: integer arithmetic overflow (C:\Users\Kenny\Desktop\1\src\tools\mmaps_generator\VMapExtensions.cpp) C:\Program Files (x86)\Microsoft Visual Studio 12.0\VC\include\ratio 36 1 mmaps_generator Error 145 error C2039: 'value' : is not a member of 'std::_Safe_multX<0x01,0x01,false>' (C:\Users\Kenny\Desktop\1\src\tools\mmaps_generator\VMapExtensions.cpp) C:\Program Files (x86)\Microsoft Visual Studio 12.0\VC\include\ratio 44 1 mmaps_generator Error 146 error C2065: 'value' : undeclared identifier (C:\Users\Kenny\Desktop\1\src\tools\mmaps_generator\VMapExtensions.cpp) C:\Program Files (x86)\Microsoft Visual Studio 12.0\VC\include\ratio 44 1 mmaps_generator Error 147 error C2057: expected constant expression (C:\Users\Kenny\Desktop\1\src\tools\mmaps_generator\VMapExtensions.cpp) C:\Program Files (x86)\Microsoft Visual Studio 12.0\VC\include\ratio 44 1 mmaps_generator Error 148 error C2039: 'value' : is not a member of 'std::_Safe_multX<0x01,0x0989680,false>' (C:\Users\Kenny\Desktop\1\src\tools\mmaps_generator\VMapExtensions.cpp) C:\Program Files (x86)\Microsoft Visual Studio 12.0\VC\include\ratio 44 1 mmaps_generator Error 149 error C2975: '_Nx' : invalid template argument for 'std::ratio', expected compile-time constant expression (C:\Users\Kenny\Desktop\1\src\tools\mmaps_generator\VMapExtensions.cpp) C:\Program Files (x86)\Microsoft Visual Studio 12.0\VC\include\ratio 219 1 mmaps_generator Error 150 error C2975: '_Dx' : invalid template argument for 'std::ratio', expected compile-time constant expression (C:\Users\Kenny\Desktop\1\src\tools\mmaps_generator\VMapExtensions.cpp) C:\Program Files (x86)\Microsoft Visual Studio 12.0\VC\include\ratio 219 1 mmaps_generator Error 151 error LNK1181: cannot open input file '..\..\common\Release\common.lib' C:\Users\Kenny\Desktop\2, 2013\src\tools\vmap4_assembler\LINK vmap4assembler Error 152 error C2338: zero denominator C:\Program Files (x86)\Microsoft Visual Studio 12.0\VC\include\ratio 121 1 scripts Error 153 error C2039: '_abs64' : is not a member of '`global namespace'' (C:\Users\Kenny\Desktop\1\src\LuaEngine\CreatureHooks.cpp) C:\Program Files (x86)\Microsoft Visual Studio 12.0\VC\include\cinttypes 22 1 LuaEngine Error 154 error C2039: '_abs64' : is not a member of '`global namespace'' (C:\Users\Kenny\Desktop\1\src\LuaEngine\BattleGroundHooks.cpp) C:\Program Files (x86)\Microsoft Visual Studio 12.0\VC\include\cinttypes 22 1 LuaEngine Error 155 error C2873: '_abs64' : symbol cannot be used in a using-declaration (C:\Users\Kenny\Desktop\1\src\LuaEngine\BattleGroundHooks.cpp) C:\Program Files (x86)\Microsoft Visual Studio 12.0\VC\include\cinttypes 22 1 LuaEngine Error 156 error C2039: '_strtoi64' : is not a member of '`global namespace'' (C:\Users\Kenny\Desktop\1\src\LuaEngine\BattleGroundHooks.cpp) C:\Program Files (x86)\Microsoft Visual Studio 12.0\VC\include\cinttypes 23 1 LuaEngine Error 157 error C2873: '_strtoi64' : symbol cannot be used in a using-declaration (C:\Users\Kenny\Desktop\1\src\LuaEngine\BattleGroundHooks.cpp) C:\Program Files (x86)\Microsoft Visual Studio 12.0\VC\include\cinttypes 23 1 LuaEngine Error 158 error C2039: '_strtoui64' : is not a member of '`global namespace'' (C:\Users\Kenny\Desktop\1\src\LuaEngine\BattleGroundHooks.cpp) C:\Program Files (x86)\Microsoft Visual Studio 12.0\VC\include\cinttypes 23 1 LuaEngine Error 159 error C2873: '_strtoui64' : symbol cannot be used in a using-declaration (C:\Users\Kenny\Desktop\1\src\LuaEngine\BattleGroundHooks.cpp) C:\Program Files (x86)\Microsoft Visual Studio 12.0\VC\include\cinttypes 23 1 LuaEngine Error 160 error C2873: '_abs64' : symbol cannot be used in a using-declaration (C:\Users\Kenny\Desktop\1\src\LuaEngine\CreatureHooks.cpp) C:\Program Files (x86)\Microsoft Visual Studio 12.0\VC\include\cinttypes 22 1 LuaEngine Error 161 error C2039: '_strtoi64' : is not a member of '`global namespace'' (C:\Users\Kenny\Desktop\1\src\LuaEngine\CreatureHooks.cpp) C:\Program Files (x86)\Microsoft Visual Studio 12.0\VC\include\cinttypes 23 1 LuaEngine Error 162 error C2873: '_strtoi64' : symbol cannot be used in a using-declaration (C:\Users\Kenny\Desktop\1\src\LuaEngine\CreatureHooks.cpp) C:\Program Files (x86)\Microsoft Visual Studio 12.0\VC\include\cinttypes 23 1 LuaEngine Error 163 error C2039: '_strtoui64' : is not a member of '`global namespace'' (C:\Users\Kenny\Desktop\1\src\LuaEngine\CreatureHooks.cpp) C:\Program Files (x86)\Microsoft Visual Studio 12.0\VC\include\cinttypes 23 1 LuaEngine Error 164 error C2873: '_strtoui64' : symbol cannot be used in a using-declaration (C:\Users\Kenny\Desktop\1\src\LuaEngine\CreatureHooks.cpp) C:\Program Files (x86)\Microsoft Visual Studio 12.0\VC\include\cinttypes 23 1 LuaEngine Error 165 error C2039: '_abs64' : is not a member of '`global namespace'' (C:\Users\Kenny\Desktop\1\src\LuaEngine\ElunaInstanceAI.cpp) C:\Program Files (x86)\Microsoft Visual Studio 12.0\VC\include\cinttypes 22 1 LuaEngine Error 166 error C2873: '_abs64' : symbol cannot be used in a using-declaration (C:\Users\Kenny\Desktop\1\src\LuaEngine\ElunaInstanceAI.cpp) C:\Program Files (x86)\Microsoft Visual Studio 12.0\VC\include\cinttypes 22 1 LuaEngine Error 167 error C2039: '_strtoi64' : is not a member of '`global namespace'' (C:\Users\Kenny\Desktop\1\src\LuaEngine\ElunaInstanceAI.cpp) C:\Program Files (x86)\Microsoft Visual Studio 12.0\VC\include\cinttypes 23 1 LuaEngine Error 168 error C2873: '_strtoi64' : symbol cannot be used in a using-declaration (C:\Users\Kenny\Desktop\1\src\LuaEngine\ElunaInstanceAI.cpp) C:\Program Files (x86)\Microsoft Visual Studio 12.0\VC\include\cinttypes 23 1 LuaEngine Error 169 error C2039: '_strtoui64' : is not a member of '`global namespace'' (C:\Users\Kenny\Desktop\1\src\LuaEngine\ElunaInstanceAI.cpp) C:\Program Files (x86)\Microsoft Visual Studio 12.0\VC\include\cinttypes 23 1 LuaEngine Error 170 error C2873: '_strtoui64' : symbol cannot be used in a using-declaration (C:\Users\Kenny\Desktop\1\src\LuaEngine\ElunaInstanceAI.cpp) C:\Program Files (x86)\Microsoft Visual Studio 12.0\VC\include\cinttypes 23 1 LuaEngine Error 171 error C2065: 'INTMAX_MAX' : undeclared identifier (C:\Users\Kenny\Desktop\1\src\LuaEngine\BattleGroundHooks.cpp) C:\Program Files (x86)\Microsoft Visual Studio 12.0\VC\include\ratio 122 1 LuaEngine Error 172 error C2065: 'INTMAX_MAX' : undeclared identifier (C:\Users\Kenny\Desktop\1\src\LuaEngine\BattleGroundHooks.cpp) C:\Program Files (x86)\Microsoft Visual Studio 12.0\VC\include\ratio 124 1 LuaEngine Error 173 error C2065: 'INTMAX_MAX' : undeclared identifier (C:\Users\Kenny\Desktop\1\src\LuaEngine\BattleGroundHooks.cpp) C:\Program Files (x86)\Microsoft Visual Studio 12.0\VC\include\ratio 44 1 LuaEngine Error 174 error C2338: integer arithmetic overflow (C:\Users\Kenny\Desktop\1\src\LuaEngine\BattleGroundHooks.cpp) C:\Program Files (x86)\Microsoft Visual Studio 12.0\VC\include\ratio 36 1 LuaEngine Error 175 error C2039: 'value' : is not a member of 'std::_Safe_multX<0x01,0x01,false>' (C:\Users\Kenny\Desktop\1\src\LuaEngine\BattleGroundHooks.cpp) C:\Program Files (x86)\Microsoft Visual Studio 12.0\VC\include\ratio 44 1 LuaEngine Error 176 error C2065: 'value' : undeclared identifier (C:\Users\Kenny\Desktop\1\src\LuaEngine\BattleGroundHooks.cpp) C:\Program Files (x86)\Microsoft Visual Studio 12.0\VC\include\ratio 44 1 LuaEngine Error 177 error C2057: expected constant expression (C:\Users\Kenny\Desktop\1\src\LuaEngine\BattleGroundHooks.cpp) C:\Program Files (x86)\Microsoft Visual Studio 12.0\VC\include\ratio 44 1 LuaEngine Error 178 error C2039: 'value' : is not a member of 'std::_Safe_multX<0x01,0x0989680,false>' (C:\Users\Kenny\Desktop\1\src\LuaEngine\BattleGroundHooks.cpp) C:\Program Files (x86)\Microsoft Visual Studio 12.0\VC\include\ratio 44 1 LuaEngine Error 179 error C2975: '_Nx' : invalid template argument for 'std::ratio', expected compile-time constant expression (C:\Users\Kenny\Desktop\1\src\LuaEngine\BattleGroundHooks.cpp) C:\Program Files (x86)\Microsoft Visual Studio 12.0\VC\include\ratio 219 1 LuaEngine Error 180 error C2975: '_Dx' : invalid template argument for 'std::ratio', expected compile-time constant expression (C:\Users\Kenny\Desktop\1\src\LuaEngine\BattleGroundHooks.cpp) C:\Program Files (x86)\Microsoft Visual Studio 12.0\VC\include\ratio 219 1 LuaEngine Error 181 error C2065: 'INTMAX_MAX' : undeclared identifier (C:\Users\Kenny\Desktop\1\src\LuaEngine\CreatureHooks.cpp) C:\Program Files (x86)\Microsoft Visual Studio 12.0\VC\include\ratio 122 1 LuaEngine Error 182 error C2065: 'INTMAX_MAX' : undeclared identifier (C:\Users\Kenny\Desktop\1\src\LuaEngine\CreatureHooks.cpp) C:\Program Files (x86)\Microsoft Visual Studio 12.0\VC\include\ratio 124 1 LuaEngine Error 183 error C2065: 'INTMAX_MAX' : undeclared identifier (C:\Users\Kenny\Desktop\1\src\LuaEngine\CreatureHooks.cpp) C:\Program Files (x86)\Microsoft Visual Studio 12.0\VC\include\ratio 44 1 LuaEngine Error 184 error C2338: integer arithmetic overflow (C:\Users\Kenny\Desktop\1\src\LuaEngine\CreatureHooks.cpp) C:\Program Files (x86)\Microsoft Visual Studio 12.0\VC\include\ratio 36 1 LuaEngine Error 185 error C2039: 'value' : is not a member of 'std::_Safe_multX<0x01,0x01,false>' (C:\Users\Kenny\Desktop\1\src\LuaEngine\CreatureHooks.cpp) C:\Program Files (x86)\Microsoft Visual Studio 12.0\VC\include\ratio 44 1 LuaEngine Error 186 error C2065: 'value' : undeclared identifier (C:\Users\Kenny\Desktop\1\src\LuaEngine\CreatureHooks.cpp) C:\Program Files (x86)\Microsoft Visual Studio 12.0\VC\include\ratio 44 1 LuaEngine Error 187 error C2057: expected constant expression (C:\Users\Kenny\Desktop\1\src\LuaEngine\CreatureHooks.cpp) C:\Program Files (x86)\Microsoft Visual Studio 12.0\VC\include\ratio 44 1 LuaEngine Error 188 error C2039: 'value' : is not a member of 'std::_Safe_multX<0x01,0x0989680,false>' (C:\Users\Kenny\Desktop\1\src\LuaEngine\CreatureHooks.cpp) C:\Program Files (x86)\Microsoft Visual Studio 12.0\VC\include\ratio 44 1 LuaEngine Error 189 error C2975: '_Nx' : invalid template argument for 'std::ratio', expected compile-time constant expression (C:\Users\Kenny\Desktop\1\src\LuaEngine\CreatureHooks.cpp) C:\Program Files (x86)\Microsoft Visual Studio 12.0\VC\include\ratio 219 1 LuaEngine Error 190 error C2975: '_Dx' : invalid template argument for 'std::ratio', expected compile-time constant expression (C:\Users\Kenny\Desktop\1\src\LuaEngine\CreatureHooks.cpp) C:\Program Files (x86)\Microsoft Visual Studio 12.0\VC\include\ratio 219 1 LuaEngine Error 191 error C2065: 'INTMAX_MAX' : undeclared identifier (C:\Users\Kenny\Desktop\1\src\LuaEngine\ElunaInstanceAI.cpp) C:\Program Files (x86)\Microsoft Visual Studio 12.0\VC\include\ratio 122 1 LuaEngine Error 192 error C2065: 'INTMAX_MAX' : undeclared identifier (C:\Users\Kenny\Desktop\1\src\LuaEngine\ElunaInstanceAI.cpp) C:\Program Files (x86)\Microsoft Visual Studio 12.0\VC\include\ratio 124 1 LuaEngine Error 193 error C2065: 'INTMAX_MAX' : undeclared identifier (C:\Users\Kenny\Desktop\1\src\LuaEngine\ElunaInstanceAI.cpp) C:\Program Files (x86)\Microsoft Visual Studio 12.0\VC\include\ratio 44 1 LuaEngine Error 194 error C2338: integer arithmetic overflow (C:\Users\Kenny\Desktop\1\src\LuaEngine\ElunaInstanceAI.cpp) C:\Program Files (x86)\Microsoft Visual Studio 12.0\VC\include\ratio 36 1 LuaEngine Error 195 error C2039: 'value' : is not a member of 'std::_Safe_multX<0x01,0x01,false>' (C:\Users\Kenny\Desktop\1\src\LuaEngine\ElunaInstanceAI.cpp) C:\Program Files (x86)\Microsoft Visual Studio 12.0\VC\include\ratio 44 1 LuaEngine Error 196 error C2065: 'value' : undeclared identifier (C:\Users\Kenny\Desktop\1\src\LuaEngine\ElunaInstanceAI.cpp) C:\Program Files (x86)\Microsoft Visual Studio 12.0\VC\include\ratio 44 1 LuaEngine Error 197 error C2057: expected constant expression (C:\Users\Kenny\Desktop\1\src\LuaEngine\ElunaInstanceAI.cpp) C:\Program Files (x86)\Microsoft Visual Studio 12.0\VC\include\ratio 44 1 LuaEngine Error 198 error C2039: 'value' : is not a member of 'std::_Safe_multX<0x01,0x0989680,false>' (C:\Users\Kenny\Desktop\1\src\LuaEngine\ElunaInstanceAI.cpp) C:\Program Files (x86)\Microsoft Visual Studio 12.0\VC\include\ratio 44 1 LuaEngine Error 199 error C2975: '_Nx' : invalid template argument for 'std::ratio', expected compile-time constant expression (C:\Users\Kenny\Desktop\1\src\LuaEngine\ElunaInstanceAI.cpp) C:\Program Files (x86)\Microsoft Visual Studio 12.0\VC\include\ratio 219 1 LuaEngine Error 200 error C2975: '_Dx' : invalid template argument for 'std::ratio', expected compile-time constant expression (C:\Users\Kenny\Desktop\1\src\LuaEngine\ElunaInstanceAI.cpp) C:\Program Files (x86)\Microsoft Visual Studio 12.0\VC\include\ratio 219 1 LuaEngine Error 201 error C2065: 'INTMAX_MAX' : undeclared identifier (C:\Users\Kenny\Desktop\1\src\LuaEngine\ElunaEventMgr.cpp) C:\Program Files (x86)\Microsoft Visual Studio 12.0\VC\include\ratio 122 1 LuaEngine Error 202 error C2065: 'INTMAX_MAX' : undeclared identifier (C:\Users\Kenny\Desktop\1\src\LuaEngine\ElunaEventMgr.cpp) C:\Program Files (x86)\Microsoft Visual Studio 12.0\VC\include\ratio 124 1 LuaEngine Error 203 error C2065: 'INTMAX_MAX' : undeclared identifier (C:\Users\Kenny\Desktop\1\src\LuaEngine\ElunaEventMgr.cpp) C:\Program Files (x86)\Microsoft Visual Studio 12.0\VC\include\ratio 44 1 LuaEngine Error 204 error C2338: integer arithmetic overflow (C:\Users\Kenny\Desktop\1\src\LuaEngine\ElunaEventMgr.cpp) C:\Program Files (x86)\Microsoft Visual Studio 12.0\VC\include\ratio 36 1 LuaEngine Error 205 error C2039: 'value' : is not a member of 'std::_Safe_multX<0x01,0x01,false>' (C:\Users\Kenny\Desktop\1\src\LuaEngine\ElunaEventMgr.cpp) C:\Program Files (x86)\Microsoft Visual Studio 12.0\VC\include\ratio 44 1 LuaEngine Error 206 error C2065: 'value' : undeclared identifier (C:\Users\Kenny\Desktop\1\src\LuaEngine\ElunaEventMgr.cpp) C:\Program Files (x86)\Microsoft Visual Studio 12.0\VC\include\ratio 44 1 LuaEngine Error 207 error C2057: expected constant expression (C:\Users\Kenny\Desktop\1\src\LuaEngine\ElunaEventMgr.cpp) C:\Program Files (x86)\Microsoft Visual Studio 12.0\VC\include\ratio 44 1 LuaEngine Error 208 error C2039: 'value' : is not a member of 'std::_Safe_multX<0x01,0x0989680,false>' (C:\Users\Kenny\Desktop\1\src\LuaEngine\ElunaEventMgr.cpp) C:\Program Files (x86)\Microsoft Visual Studio 12.0\VC\include\ratio 44 1 LuaEngine Error 209 error C2975: '_Nx' : invalid template argument for 'std::ratio', expected compile-time constant expression (C:\Users\Kenny\Desktop\1\src\LuaEngine\ElunaEventMgr.cpp) C:\Program Files (x86)\Microsoft Visual Studio 12.0\VC\include\ratio 219 1 LuaEngine Error 210 error C2975: '_Dx' : invalid template argument for 'std::ratio', expected compile-time constant expression (C:\Users\Kenny\Desktop\1\src\LuaEngine\ElunaEventMgr.cpp) C:\Program Files (x86)\Microsoft Visual Studio 12.0\VC\include\ratio 219 1 LuaEngine Error 211 error C2338: zero denominator (C:\Users\Kenny\Desktop\1\src\LuaEngine\BattleGroundHooks.cpp) C:\Program Files (x86)\Microsoft Visual Studio 12.0\VC\include\ratio 121 1 LuaEngine Error 212 error C2338: zero denominator (C:\Users\Kenny\Desktop\1\src\LuaEngine\CreatureHooks.cpp) C:\Program Files (x86)\Microsoft Visual Studio 12.0\VC\include\ratio 121 1 LuaEngine Error 213 error C2338: zero denominator (C:\Users\Kenny\Desktop\1\src\LuaEngine\ElunaInstanceAI.cpp) C:\Program Files (x86)\Microsoft Visual Studio 12.0\VC\include\ratio 121 1 LuaEngine Error 214 error C2338: zero denominator (C:\Users\Kenny\Desktop\1\src\LuaEngine\ElunaEventMgr.cpp) C:\Program Files (x86)\Microsoft Visual Studio 12.0\VC\include\ratio 121 1 LuaEngine Error 215 error C2065: 'INTMAX_MAX' : undeclared identifier (C:\Users\Kenny\Desktop\1\src\LuaEngine\ElunaUtility.cpp) C:\Program Files (x86)\Microsoft Visual Studio 12.0\VC\include\ratio 122 1 LuaEngine Error 216 error C2065: 'INTMAX_MAX' : undeclared identifier (C:\Users\Kenny\Desktop\1\src\LuaEngine\ElunaUtility.cpp) C:\Program Files (x86)\Microsoft Visual Studio 12.0\VC\include\ratio 124 1 LuaEngine Error 217 error C2065: 'INTMAX_MAX' : undeclared identifier (C:\Users\Kenny\Desktop\1\src\LuaEngine\ElunaUtility.cpp) C:\Program Files (x86)\Microsoft Visual Studio 12.0\VC\include\ratio 44 1 LuaEngine Error 218 error C2338: integer arithmetic overflow (C:\Users\Kenny\Desktop\1\src\LuaEngine\ElunaUtility.cpp) C:\Program Files (x86)\Microsoft Visual Studio 12.0\VC\include\ratio 36 1 LuaEngine Error 219 error C2039: 'value' : is not a member of 'std::_Safe_multX<0x01,0x01,false>' (C:\Users\Kenny\Desktop\1\src\LuaEngine\ElunaUtility.cpp) C:\Program Files (x86)\Microsoft Visual Studio 12.0\VC\include\ratio 44 1 LuaEngine Error 220 error C2065: 'value' : undeclared identifier (C:\Users\Kenny\Desktop\1\src\LuaEngine\ElunaUtility.cpp) C:\Program Files (x86)\Microsoft Visual Studio 12.0\VC\include\ratio 44 1 LuaEngine Error 221 error C2057: expected constant expression (C:\Users\Kenny\Desktop\1\src\LuaEngine\ElunaUtility.cpp) C:\Program Files (x86)\Microsoft Visual Studio 12.0\VC\include\ratio 44 1 LuaEngine Error 222 error C2039: 'value' : is not a member of 'std::_Safe_multX<0x01,0x0989680,false>' (C:\Users\Kenny\Desktop\1\src\LuaEngine\ElunaUtility.cpp) C:\Program Files (x86)\Microsoft Visual Studio 12.0\VC\include\ratio 44 1 LuaEngine Error 223 error C2975: '_Nx' : invalid template argument for 'std::ratio', expected compile-time constant expression (C:\Users\Kenny\Desktop\1\src\LuaEngine\ElunaUtility.cpp) C:\Program Files (x86)\Microsoft Visual Studio 12.0\VC\include\ratio 219 1 LuaEngine Error 224 error C2975: '_Dx' : invalid template argument for 'std::ratio', expected compile-time constant expression (C:\Users\Kenny\Desktop\1\src\LuaEngine\ElunaUtility.cpp) C:\Program Files (x86)\Microsoft Visual Studio 12.0\VC\include\ratio 219 1 LuaEngine Error 225 error C2039: '_abs64' : is not a member of '`global namespace'' (C:\Users\Kenny\Desktop\1\src\LuaEngine\GameObjectHooks.cpp) C:\Program Files (x86)\Microsoft Visual Studio 12.0\VC\include\cinttypes 22 1 LuaEngine Error 226 error C2873: '_abs64' : symbol cannot be used in a using-declaration (C:\Users\Kenny\Desktop\1\src\LuaEngine\GameObjectHooks.cpp) C:\Program Files (x86)\Microsoft Visual Studio 12.0\VC\include\cinttypes 22 1 LuaEngine Error 227 error C2039: '_strtoi64' : is not a member of '`global namespace'' (C:\Users\Kenny\Desktop\1\src\LuaEngine\GameObjectHooks.cpp) C:\Program Files (x86)\Microsoft Visual Studio 12.0\VC\include\cinttypes 23 1 LuaEngine Error 228 error C2873: '_strtoi64' : symbol cannot be used in a using-declaration (C:\Users\Kenny\Desktop\1\src\LuaEngine\GameObjectHooks.cpp) C:\Program Files (x86)\Microsoft Visual Studio 12.0\VC\include\cinttypes 23 1 LuaEngine Error 229 error C2039: '_strtoui64' : is not a member of '`global namespace'' (C:\Users\Kenny\Desktop\1\src\LuaEngine\GameObjectHooks.cpp) C:\Program Files (x86)\Microsoft Visual Studio 12.0\VC\include\cinttypes 23 1 LuaEngine Error 230 error C2873: '_strtoui64' : symbol cannot be used in a using-declaration (C:\Users\Kenny\Desktop\1\src\LuaEngine\GameObjectHooks.cpp) C:\Program Files (x86)\Microsoft Visual Studio 12.0\VC\include\cinttypes 23 1 LuaEngine Error 231 error C2065: 'INTMAX_MAX' : undeclared identifier (C:\Users\Kenny\Desktop\1\src\LuaEngine\GameObjectHooks.cpp) C:\Program Files (x86)\Microsoft Visual Studio 12.0\VC\include\ratio 122 1 LuaEngine Error 232 error C2065: 'INTMAX_MAX' : undeclared identifier (C:\Users\Kenny\Desktop\1\src\LuaEngine\GameObjectHooks.cpp) C:\Program Files (x86)\Microsoft Visual Studio 12.0\VC\include\ratio 124 1 LuaEngine Error 233 error C2065: 'INTMAX_MAX' : undeclared identifier (C:\Users\Kenny\Desktop\1\src\LuaEngine\GameObjectHooks.cpp) C:\Program Files (x86)\Microsoft Visual Studio 12.0\VC\include\ratio 44 1 LuaEngine Error 234 error C2338: integer arithmetic overflow (C:\Users\Kenny\Desktop\1\src\LuaEngine\GameObjectHooks.cpp) C:\Program Files (x86)\Microsoft Visual Studio 12.0\VC\include\ratio 36 1 LuaEngine Error 235 error C2039: 'value' : is not a member of 'std::_Safe_multX<0x01,0x01,false>' (C:\Users\Kenny\Desktop\1\src\LuaEngine\GameObjectHooks.cpp) C:\Program Files (x86)\Microsoft Visual Studio 12.0\VC\include\ratio 44 1 LuaEngine Error 236 error C2065: 'value' : undeclared identifier (C:\Users\Kenny\Desktop\1\src\LuaEngine\GameObjectHooks.cpp) C:\Program Files (x86)\Microsoft Visual Studio 12.0\VC\include\ratio 44 1 LuaEngine Error 237 error C2057: expected constant expression (C:\Users\Kenny\Desktop\1\src\LuaEngine\GameObjectHooks.cpp) C:\Program Files (x86)\Microsoft Visual Studio 12.0\VC\include\ratio 44 1 LuaEngine Error 238 error C2039: 'value' : is not a member of 'std::_Safe_multX<0x01,0x0989680,false>' (C:\Users\Kenny\Desktop\1\src\LuaEngine\GameObjectHooks.cpp) C:\Program Files (x86)\Microsoft Visual Studio 12.0\VC\include\ratio 44 1 LuaEngine Error 239 error C2975: '_Nx' : invalid template argument for 'std::ratio', expected compile-time constant expression (C:\Users\Kenny\Desktop\1\src\LuaEngine\GameObjectHooks.cpp) C:\Program Files (x86)\Microsoft Visual Studio 12.0\VC\include\ratio 219 1 LuaEngine Error 240 error C2975: '_Dx' : invalid template argument for 'std::ratio', expected compile-time constant expression (C:\Users\Kenny\Desktop\1\src\LuaEngine\GameObjectHooks.cpp) C:\Program Files (x86)\Microsoft Visual Studio 12.0\VC\include\ratio 219 1 LuaEngine Error 241 error C2039: '_abs64' : is not a member of '`global namespace'' (C:\Users\Kenny\Desktop\1\src\LuaEngine\GossipHooks.cpp) C:\Program Files (x86)\Microsoft Visual Studio 12.0\VC\include\cinttypes 22 1 LuaEngine Error 242 error C2873: '_abs64' : symbol cannot be used in a using-declaration (C:\Users\Kenny\Desktop\1\src\LuaEngine\GossipHooks.cpp) C:\Program Files (x86)\Microsoft Visual Studio 12.0\VC\include\cinttypes 22 1 LuaEngine Error 243 error C2039: '_strtoi64' : is not a member of '`global namespace'' (C:\Users\Kenny\Desktop\1\src\LuaEngine\GossipHooks.cpp) C:\Program Files (x86)\Microsoft Visual Studio 12.0\VC\include\cinttypes 23 1 LuaEngine Error 244 error C2873: '_strtoi64' : symbol cannot be used in a using-declaration (C:\Users\Kenny\Desktop\1\src\LuaEngine\GossipHooks.cpp) C:\Program Files (x86)\Microsoft Visual Studio 12.0\VC\include\cinttypes 23 1 LuaEngine Error 245 error C2039: '_strtoui64' : is not a member of '`global namespace'' (C:\Users\Kenny\Desktop\1\src\LuaEngine\GossipHooks.cpp) C:\Program Files (x86)\Microsoft Visual Studio 12.0\VC\include\cinttypes 23 1 LuaEngine Error 246 error C2873: '_strtoui64' : symbol cannot be used in a using-declaration (C:\Users\Kenny\Desktop\1\src\LuaEngine\GossipHooks.cpp) C:\Program Files (x86)\Microsoft Visual Studio 12.0\VC\include\cinttypes 23 1 LuaEngine Error 247 error C2065: 'INTMAX_MAX' : undeclared identifier (C:\Users\Kenny\Desktop\1\src\LuaEngine\GossipHooks.cpp) C:\Program Files (x86)\Microsoft Visual Studio 12.0\VC\include\ratio 122 1 LuaEngine Error 248 error C2065: 'INTMAX_MAX' : undeclared identifier (C:\Users\Kenny\Desktop\1\src\LuaEngine\GossipHooks.cpp) C:\Program Files (x86)\Microsoft Visual Studio 12.0\VC\include\ratio 124 1 LuaEngine Error 249 error C2065: 'INTMAX_MAX' : undeclared identifier (C:\Users\Kenny\Desktop\1\src\LuaEngine\GossipHooks.cpp) C:\Program Files (x86)\Microsoft Visual Studio 12.0\VC\include\ratio 44 1 LuaEngine Error 250 error C2338: integer arithmetic overflow (C:\Users\Kenny\Desktop\1\src\LuaEngine\GossipHooks.cpp) C:\Program Files (x86)\Microsoft Visual Studio 12.0\VC\include\ratio 36 1 LuaEngine Error 251 error C2039: 'value' : is not a member of 'std::_Safe_multX<0x01,0x01,false>' (C:\Users\Kenny\Desktop\1\src\LuaEngine\GossipHooks.cpp) C:\Program Files (x86)\Microsoft Visual Studio 12.0\VC\include\ratio 44 1 LuaEngine Error 252 error C2065: 'value' : undeclared identifier (C:\Users\Kenny\Desktop\1\src\LuaEngine\GossipHooks.cpp) C:\Program Files (x86)\Microsoft Visual Studio 12.0\VC\include\ratio 44 1 LuaEngine Error 253 error C2057: expected constant expression (C:\Users\Kenny\Desktop\1\src\LuaEngine\GossipHooks.cpp) C:\Program Files (x86)\Microsoft Visual Studio 12.0\VC\include\ratio 44 1 LuaEngine Error 254 error C2039: 'value' : is not a member of 'std::_Safe_multX<0x01,0x0989680,false>' (C:\Users\Kenny\Desktop\1\src\LuaEngine\GossipHooks.cpp) C:\Program Files (x86)\Microsoft Visual Studio 12.0\VC\include\ratio 44 1 LuaEngine Error 255 error C2975: '_Nx' : invalid template argument for 'std::ratio', expected compile-time constant expression (C:\Users\Kenny\Desktop\1\src\LuaEngine\GossipHooks.cpp) C:\Program Files (x86)\Microsoft Visual Studio 12.0\VC\include\ratio 219 1 LuaEngine Error 256 error C2975: '_Dx' : invalid template argument for 'std::ratio', expected compile-time constant expression (C:\Users\Kenny\Desktop\1\src\LuaEngine\GossipHooks.cpp) C:\Program Files (x86)\Microsoft Visual Studio 12.0\VC\include\ratio 219 1 LuaEngine Error 257 error C2338: zero denominator (C:\Users\Kenny\Desktop\1\src\LuaEngine\GameObjectHooks.cpp) C:\Program Files (x86)\Microsoft Visual Studio 12.0\VC\include\ratio 121 1 LuaEngine Error 258 error C2338: zero denominator (C:\Users\Kenny\Desktop\1\src\LuaEngine\ElunaUtility.cpp) C:\Program Files (x86)\Microsoft Visual Studio 12.0\VC\include\ratio 121 1 LuaEngine Error 259 error C2338: zero denominator (C:\Users\Kenny\Desktop\1\src\LuaEngine\GossipHooks.cpp) C:\Program Files (x86)\Microsoft Visual Studio 12.0\VC\include\ratio 121 1 LuaEngine Error 260 error C2039: '_abs64' : is not a member of '`global namespace'' (C:\Users\Kenny\Desktop\1\src\LuaEngine\GroupHooks.cpp) C:\Program Files (x86)\Microsoft Visual Studio 12.0\VC\include\cinttypes 22 1 LuaEngine Error 261 error C2873: '_abs64' : symbol cannot be used in a using-declaration (C:\Users\Kenny\Desktop\1\src\LuaEngine\GroupHooks.cpp) C:\Program Files (x86)\Microsoft Visual Studio 12.0\VC\include\cinttypes 22 1 LuaEngine Error 262 error C2039: '_strtoi64' : is not a member of '`global namespace'' (C:\Users\Kenny\Desktop\1\src\LuaEngine\GroupHooks.cpp) C:\Program Files (x86)\Microsoft Visual Studio 12.0\VC\include\cinttypes 23 1 LuaEngine Error 263 error C2873: '_strtoi64' : symbol cannot be used in a using-declaration (C:\Users\Kenny\Desktop\1\src\LuaEngine\GroupHooks.cpp) C:\Program Files (x86)\Microsoft Visual Studio 12.0\VC\include\cinttypes 23 1 LuaEngine Error 264 error C2039: '_strtoui64' : is not a member of '`global namespace'' (C:\Users\Kenny\Desktop\1\src\LuaEngine\GroupHooks.cpp) C:\Program Files (x86)\Microsoft Visual Studio 12.0\VC\include\cinttypes 23 1 LuaEngine Error 265 error C2873: '_strtoui64' : symbol cannot be used in a using-declaration (C:\Users\Kenny\Desktop\1\src\LuaEngine\GroupHooks.cpp) C:\Program Files (x86)\Microsoft Visual Studio 12.0\VC\include\cinttypes 23 1 LuaEngine Error 266 error C2065: 'INTMAX_MAX' : undeclared identifier (C:\Users\Kenny\Desktop\1\src\LuaEngine\GroupHooks.cpp) C:\Program Files (x86)\Microsoft Visual Studio 12.0\VC\include\ratio 122 1 LuaEngine Error 267 error C2065: 'INTMAX_MAX' : undeclared identifier (C:\Users\Kenny\Desktop\1\src\LuaEngine\GroupHooks.cpp) C:\Program Files (x86)\Microsoft Visual Studio 12.0\VC\include\ratio 124 1 LuaEngine Error 268 error C2065: 'INTMAX_MAX' : undeclared identifier (C:\Users\Kenny\Desktop\1\src\LuaEngine\GroupHooks.cpp) C:\Program Files (x86)\Microsoft Visual Studio 12.0\VC\include\ratio 44 1 LuaEngine Error 269 error C2338: integer arithmetic overflow (C:\Users\Kenny\Desktop\1\src\LuaEngine\GroupHooks.cpp) C:\Program Files (x86)\Microsoft Visual Studio 12.0\VC\include\ratio 36 1 LuaEngine Error 270 error C2039: 'value' : is not a member of 'std::_Safe_multX<0x01,0x01,false>' (C:\Users\Kenny\Desktop\1\src\LuaEngine\GroupHooks.cpp) C:\Program Files (x86)\Microsoft Visual Studio 12.0\VC\include\ratio 44 1 LuaEngine Error 271 error C2065: 'value' : undeclared identifier (C:\Users\Kenny\Desktop\1\src\LuaEngine\GroupHooks.cpp) C:\Program Files (x86)\Microsoft Visual Studio 12.0\VC\include\ratio 44 1 LuaEngine Error 272 error C2057: expected constant expression (C:\Users\Kenny\Desktop\1\src\LuaEngine\GroupHooks.cpp) C:\Program Files (x86)\Microsoft Visual Studio 12.0\VC\include\ratio 44 1 LuaEngine Error 273 error C2039: 'value' : is not a member of 'std::_Safe_multX<0x01,0x0989680,false>' (C:\Users\Kenny\Desktop\1\src\LuaEngine\GroupHooks.cpp) C:\Program Files (x86)\Microsoft Visual Studio 12.0\VC\include\ratio 44 1 LuaEngine Error 274 error C2975: '_Nx' : invalid template argument for 'std::ratio', expected compile-time constant expression (C:\Users\Kenny\Desktop\1\src\LuaEngine\GroupHooks.cpp) C:\Program Files (x86)\Microsoft Visual Studio 12.0\VC\include\ratio 219 1 LuaEngine Error 275 error C2975: '_Dx' : invalid template argument for 'std::ratio', expected compile-time constant expression (C:\Users\Kenny\Desktop\1\src\LuaEngine\GroupHooks.cpp) C:\Program Files (x86)\Microsoft Visual Studio 12.0\VC\include\ratio 219 1 LuaEngine Error 276 error C2338: zero denominator (C:\Users\Kenny\Desktop\1\src\LuaEngine\GroupHooks.cpp) C:\Program Files (x86)\Microsoft Visual Studio 12.0\VC\include\ratio 121 1 LuaEngine Error 277 error C2039: '_abs64' : is not a member of '`global namespace'' (C:\Users\Kenny\Desktop\1\src\LuaEngine\GuildHooks.cpp) C:\Program Files (x86)\Microsoft Visual Studio 12.0\VC\include\cinttypes 22 1 LuaEngine Error 278 error C2873: '_abs64' : symbol cannot be used in a using-declaration (C:\Users\Kenny\Desktop\1\src\LuaEngine\GuildHooks.cpp) C:\Program Files (x86)\Microsoft Visual Studio 12.0\VC\include\cinttypes 22 1 LuaEngine Error 279 error C2039: '_strtoi64' : is not a member of '`global namespace'' (C:\Users\Kenny\Desktop\1\src\LuaEngine\GuildHooks.cpp) C:\Program Files (x86)\Microsoft Visual Studio 12.0\VC\include\cinttypes 23 1 LuaEngine Error 280 error C2873: '_strtoi64' : symbol cannot be used in a using-declaration (C:\Users\Kenny\Desktop\1\src\LuaEngine\GuildHooks.cpp) C:\Program Files (x86)\Microsoft Visual Studio 12.0\VC\include\cinttypes 23 1 LuaEngine Error 281 error C2039: '_strtoui64' : is not a member of '`global namespace'' (C:\Users\Kenny\Desktop\1\src\LuaEngine\GuildHooks.cpp) C:\Program Files (x86)\Microsoft Visual Studio 12.0\VC\include\cinttypes 23 1 LuaEngine Error 282 error C2873: '_strtoui64' : symbol cannot be used in a using-declaration (C:\Users\Kenny\Desktop\1\src\LuaEngine\GuildHooks.cpp) C:\Program Files (x86)\Microsoft Visual Studio 12.0\VC\include\cinttypes 23 1 LuaEngine Error 283 error C2065: 'INTMAX_MAX' : undeclared identifier (C:\Users\Kenny\Desktop\1\src\LuaEngine\GuildHooks.cpp) C:\Program Files (x86)\Microsoft Visual Studio 12.0\VC\include\ratio 122 1 LuaEngine Error 284 error C2065: 'INTMAX_MAX' : undeclared identifier (C:\Users\Kenny\Desktop\1\src\LuaEngine\GuildHooks.cpp) C:\Program Files (x86)\Microsoft Visual Studio 12.0\VC\include\ratio 124 1 LuaEngine Error 285 error C2065: 'INTMAX_MAX' : undeclared identifier (C:\Users\Kenny\Desktop\1\src\LuaEngine\GuildHooks.cpp) C:\Program Files (x86)\Microsoft Visual Studio 12.0\VC\include\ratio 44 1 LuaEngine Error 286 error C2338: integer arithmetic overflow (C:\Users\Kenny\Desktop\1\src\LuaEngine\GuildHooks.cpp) C:\Program Files (x86)\Microsoft Visual Studio 12.0\VC\include\ratio 36 1 LuaEngine Error 287 error C2039: 'value' : is not a member of 'std::_Safe_multX<0x01,0x01,false>' (C:\Users\Kenny\Desktop\1\src\LuaEngine\GuildHooks.cpp) C:\Program Files (x86)\Microsoft Visual Studio 12.0\VC\include\ratio 44 1 LuaEngine Error 288 error C2065: 'value' : undeclared identifier (C:\Users\Kenny\Desktop\1\src\LuaEngine\GuildHooks.cpp) C:\Program Files (x86)\Microsoft Visual Studio 12.0\VC\include\ratio 44 1 LuaEngine Error 289 error C2057: expected constant expression (C:\Users\Kenny\Desktop\1\src\LuaEngine\GuildHooks.cpp) C:\Program Files (x86)\Microsoft Visual Studio 12.0\VC\include\ratio 44 1 LuaEngine Error 290 error C2039: 'value' : is not a member of 'std::_Safe_multX<0x01,0x0989680,false>' (C:\Users\Kenny\Desktop\1\src\LuaEngine\GuildHooks.cpp) C:\Program Files (x86)\Microsoft Visual Studio 12.0\VC\include\ratio 44 1 LuaEngine Error 291 error C2975: '_Nx' : invalid template argument for 'std::ratio', expected compile-time constant expression (C:\Users\Kenny\Desktop\1\src\LuaEngine\GuildHooks.cpp) C:\Program Files (x86)\Microsoft Visual Studio 12.0\VC\include\ratio 219 1 LuaEngine Error 292 error C2975: '_Dx' : invalid template argument for 'std::ratio', expected compile-time constant expression (C:\Users\Kenny\Desktop\1\src\LuaEngine\GuildHooks.cpp) C:\Program Files (x86)\Microsoft Visual Studio 12.0\VC\include\ratio 219 1 LuaEngine Error 293 error C2338: zero denominator (C:\Users\Kenny\Desktop\1\src\LuaEngine\GuildHooks.cpp) C:\Program Files (x86)\Microsoft Visual Studio 12.0\VC\include\ratio 121 1 LuaEngine Error 294 error C2039: '_abs64' : is not a member of '`global namespace'' (C:\Users\Kenny\Desktop\1\src\LuaEngine\InstanceHooks.cpp) C:\Program Files (x86)\Microsoft Visual Studio 12.0\VC\include\cinttypes 22 1 LuaEngine Error 295 error C2873: '_abs64' : symbol cannot be used in a using-declaration (C:\Users\Kenny\Desktop\1\src\LuaEngine\InstanceHooks.cpp) C:\Program Files (x86)\Microsoft Visual Studio 12.0\VC\include\cinttypes 22 1 LuaEngine Error 296 error C2039: '_strtoi64' : is not a member of '`global namespace'' (C:\Users\Kenny\Desktop\1\src\LuaEngine\InstanceHooks.cpp) C:\Program Files (x86)\Microsoft Visual Studio 12.0\VC\include\cinttypes 23 1 LuaEngine Error 297 error C2873: '_strtoi64' : symbol cannot be used in a using-declaration (C:\Users\Kenny\Desktop\1\src\LuaEngine\InstanceHooks.cpp) C:\Program Files (x86)\Microsoft Visual Studio 12.0\VC\include\cinttypes 23 1 LuaEngine Error 298 error C2039: '_strtoui64' : is not a member of '`global namespace'' (C:\Users\Kenny\Desktop\1\src\LuaEngine\InstanceHooks.cpp) C:\Program Files (x86)\Microsoft Visual Studio 12.0\VC\include\cinttypes 23 1 LuaEngine Error 299 error C2873: '_strtoui64' : symbol cannot be used in a using-declaration (C:\Users\Kenny\Desktop\1\src\LuaEngine\InstanceHooks.cpp) C:\Program Files (x86)\Microsoft Visual Studio 12.0\VC\include\cinttypes 23 1 LuaEngine Error 300 error C2065: 'INTMAX_MAX' : undeclared identifier (C:\Users\Kenny\Desktop\1\src\LuaEngine\InstanceHooks.cpp) C:\Program Files (x86)\Microsoft Visual Studio 12.0\VC\include\ratio 122 1 LuaEngine Error 301 error C2065: 'INTMAX_MAX' : undeclared identifier (C:\Users\Kenny\Desktop\1\src\LuaEngine\InstanceHooks.cpp) C:\Program Files (x86)\Microsoft Visual Studio 12.0\VC\include\ratio 124 1 LuaEngine Error 302 error C2065: 'INTMAX_MAX' : undeclared identifier (C:\Users\Kenny\Desktop\1\src\LuaEngine\InstanceHooks.cpp) C:\Program Files (x86)\Microsoft Visual Studio 12.0\VC\include\ratio 44 1 LuaEngine Error 303 error C2338: integer arithmetic overflow (C:\Users\Kenny\Desktop\1\src\LuaEngine\InstanceHooks.cpp) C:\Program Files (x86)\Microsoft Visual Studio 12.0\VC\include\ratio 36 1 LuaEngine Error 304 error C2039: 'value' : is not a member of 'std::_Safe_multX<0x01,0x01,false>' (C:\Users\Kenny\Desktop\1\src\LuaEngine\InstanceHooks.cpp) C:\Program Files (x86)\Microsoft Visual Studio 12.0\VC\include\ratio 44 1 LuaEngine Error 305 error C2065: 'value' : undeclared identifier (C:\Users\Kenny\Desktop\1\src\LuaEngine\InstanceHooks.cpp) C:\Program Files (x86)\Microsoft Visual Studio 12.0\VC\include\ratio 44 1 LuaEngine Error 306 error C2057: expected constant expression (C:\Users\Kenny\Desktop\1\src\LuaEngine\InstanceHooks.cpp) C:\Program Files (x86)\Microsoft Visual Studio 12.0\VC\include\ratio 44 1 LuaEngine Error 307 error C2039: 'value' : is not a member of 'std::_Safe_multX<0x01,0x0989680,false>' (C:\Users\Kenny\Desktop\1\src\LuaEngine\InstanceHooks.cpp) C:\Program Files (x86)\Microsoft Visual Studio 12.0\VC\include\ratio 44 1 LuaEngine Error 308 error C2975: '_Nx' : invalid template argument for 'std::ratio', expected compile-time constant expression (C:\Users\Kenny\Desktop\1\src\LuaEngine\InstanceHooks.cpp) C:\Program Files (x86)\Microsoft Visual Studio 12.0\VC\include\ratio 219 1 LuaEngine Error 309 error C2975: '_Dx' : invalid template argument for 'std::ratio', expected compile-time constant expression (C:\Users\Kenny\Desktop\1\src\LuaEngine\InstanceHooks.cpp) C:\Program Files (x86)\Microsoft Visual Studio 12.0\VC\include\ratio 219 1 LuaEngine Error 310 error C2338: zero denominator (C:\Users\Kenny\Desktop\1\src\LuaEngine\InstanceHooks.cpp) C:\Program Files (x86)\Microsoft Visual Studio 12.0\VC\include\ratio 121 1 LuaEngine Error 311 error C2039: '_abs64' : is not a member of '`global namespace'' C:\Program Files (x86)\Microsoft Visual Studio 12.0\VC\include\cinttypes 22 1 authserver Error 312 error C2873: '_abs64' : symbol cannot be used in a using-declaration C:\Program Files (x86)\Microsoft Visual Studio 12.0\VC\include\cinttypes 22 1 authserver Error 313 error C2039: '_strtoi64' : is not a member of '`global namespace'' C:\Program Files (x86)\Microsoft Visual Studio 12.0\VC\include\cinttypes 23 1 authserver Error 314 error C2873: '_strtoi64' : symbol cannot be used in a using-declaration C:\Program Files (x86)\Microsoft Visual Studio 12.0\VC\include\cinttypes 23 1 authserver Error 315 error C2039: '_strtoui64' : is not a member of '`global namespace'' C:\Program Files (x86)\Microsoft Visual Studio 12.0\VC\include\cinttypes 23 1 authserver Error 316 error C2873: '_strtoui64' : symbol cannot be used in a using-declaration C:\Program Files (x86)\Microsoft Visual Studio 12.0\VC\include\cinttypes 23 1 authserver Error 317 error C2065: 'INTMAX_MAX' : undeclared identifier C:\Program Files (x86)\Microsoft Visual Studio 12.0\VC\include\ratio 122 1 authserver Error 318 error C2065: 'INTMAX_MAX' : undeclared identifier C:\Program Files (x86)\Microsoft Visual Studio 12.0\VC\include\ratio 124 1 authserver Error 319 error C2065: 'INTMAX_MAX' : undeclared identifier C:\Program Files (x86)\Microsoft Visual Studio 12.0\VC\include\ratio 44 1 authserver Error 320 error C2338: integer arithmetic overflow C:\Program Files (x86)\Microsoft Visual Studio 12.0\VC\include\ratio 36 1 authserver Error 321 error C2039: 'value' : is not a member of 'std::_Safe_multX<0x01,0x01,false>' C:\Program Files (x86)\Microsoft Visual Studio 12.0\VC\include\ratio 44 1 authserver Error 322 error C2065: 'value' : undeclared identifier C:\Program Files (x86)\Microsoft Visual Studio 12.0\VC\include\ratio 44 1 authserver Error 323 error C2057: expected constant expression C:\Program Files (x86)\Microsoft Visual Studio 12.0\VC\include\ratio 44 1 authserver Error 324 error C2039: 'value' : is not a member of 'std::_Safe_multX<0x01,0x0989680,false>' C:\Program Files (x86)\Microsoft Visual Studio 12.0\VC\include\ratio 44 1 authserver Error 325 error C2975: '_Nx' : invalid template argument for 'std::ratio', expected compile-time constant expression C:\Program Files (x86)\Microsoft Visual Studio 12.0\VC\include\ratio 219 1 authserver Error 326 error C2975: '_Dx' : invalid template argument for 'std::ratio', expected compile-time constant expression C:\Program Files (x86)\Microsoft Visual Studio 12.0\VC\include\ratio 219 1 authserver Error 327 error C2039: '_abs64' : is not a member of '`global namespace'' (C:\Users\Kenny\Desktop\1\src\LuaEngine\ItemHooks.cpp) C:\Program Files (x86)\Microsoft Visual Studio 12.0\VC\include\cinttypes 22 1 LuaEngine Error 328 error C2873: '_abs64' : symbol cannot be used in a using-declaration (C:\Users\Kenny\Desktop\1\src\LuaEngine\ItemHooks.cpp) C:\Program Files (x86)\Microsoft Visual Studio 12.0\VC\include\cinttypes 22 1 LuaEngine Error 329 error C2039: '_strtoi64' : is not a member of '`global namespace'' (C:\Users\Kenny\Desktop\1\src\LuaEngine\ItemHooks.cpp) C:\Program Files (x86)\Microsoft Visual Studio 12.0\VC\include\cinttypes 23 1 LuaEngine Error 330 error C2873: '_strtoi64' : symbol cannot be used in a using-declaration (C:\Users\Kenny\Desktop\1\src\LuaEngine\ItemHooks.cpp) C:\Program Files (x86)\Microsoft Visual Studio 12.0\VC\include\cinttypes 23 1 LuaEngine Error 331 error C2039: '_strtoui64' : is not a member of '`global namespace'' (C:\Users\Kenny\Desktop\1\src\LuaEngine\ItemHooks.cpp) C:\Program Files (x86)\Microsoft Visual Studio 12.0\VC\include\cinttypes 23 1 LuaEngine Error 332 error C2873: '_strtoui64' : symbol cannot be used in a using-declaration (C:\Users\Kenny\Desktop\1\src\LuaEngine\ItemHooks.cpp) C:\Program Files (x86)\Microsoft Visual Studio 12.0\VC\include\cinttypes 23 1 LuaEngine Error 333 error C2065: 'INTMAX_MAX' : undeclared identifier (C:\Users\Kenny\Desktop\1\src\LuaEngine\ItemHooks.cpp) C:\Program Files (x86)\Microsoft Visual Studio 12.0\VC\include\ratio 122 1 LuaEngine Error 334 error C2065: 'INTMAX_MAX' : undeclared identifier (C:\Users\Kenny\Desktop\1\src\LuaEngine\ItemHooks.cpp) C:\Program Files (x86)\Microsoft Visual Studio 12.0\VC\include\ratio 124 1 LuaEngine Error 335 error C2065: 'INTMAX_MAX' : undeclared identifier (C:\Users\Kenny\Desktop\1\src\LuaEngine\ItemHooks.cpp) C:\Program Files (x86)\Microsoft Visual Studio 12.0\VC\include\ratio 44 1 LuaEngine Error 336 error C2338: integer arithmetic overflow (C:\Users\Kenny\Desktop\1\src\LuaEngine\ItemHooks.cpp) C:\Program Files (x86)\Microsoft Visual Studio 12.0\VC\include\ratio 36 1 LuaEngine Error 337 error C2039: 'value' : is not a member of 'std::_Safe_multX<0x01,0x01,false>' (C:\Users\Kenny\Desktop\1\src\LuaEngine\ItemHooks.cpp) C:\Program Files (x86)\Microsoft Visual Studio 12.0\VC\include\ratio 44 1 LuaEngine Error 338 error C2065: 'value' : undeclared identifier (C:\Users\Kenny\Desktop\1\src\LuaEngine\ItemHooks.cpp) C:\Program Files (x86)\Microsoft Visual Studio 12.0\VC\include\ratio 44 1 LuaEngine Error 339 error C2057: expected constant expression (C:\Users\Kenny\Desktop\1\src\LuaEngine\ItemHooks.cpp) C:\Program Files (x86)\Microsoft Visual Studio 12.0\VC\include\ratio 44 1 LuaEngine Error 340 error C2039: 'value' : is not a member of 'std::_Safe_multX<0x01,0x0989680,false>' (C:\Users\Kenny\Desktop\1\src\LuaEngine\ItemHooks.cpp) C:\Program Files (x86)\Microsoft Visual Studio 12.0\VC\include\ratio 44 1 LuaEngine Error 341 error C2975: '_Nx' : invalid template argument for 'std::ratio', expected compile-time constant expression (C:\Users\Kenny\Desktop\1\src\LuaEngine\ItemHooks.cpp) C:\Program Files (x86)\Microsoft Visual Studio 12.0\VC\include\ratio 219 1 LuaEngine Error 342 error C2975: '_Dx' : invalid template argument for 'std::ratio', expected compile-time constant expression (C:\Users\Kenny\Desktop\1\src\LuaEngine\ItemHooks.cpp) C:\Program Files (x86)\Microsoft Visual Studio 12.0\VC\include\ratio 219 1 LuaEngine Error 343 error C2338: zero denominator (C:\Users\Kenny\Desktop\1\src\LuaEngine\ItemHooks.cpp) C:\Program Files (x86)\Microsoft Visual Studio 12.0\VC\include\ratio 121 1 LuaEngine Error 344 error C2065: 'UINT32_MAX' : undeclared identifier C:\Users\Kenny\Desktop\1\src\LuaEngine\lmarshal.cpp 81 1 LuaEngine Error 345 error C2039: '_abs64' : is not a member of '`global namespace'' (C:\Users\Kenny\Desktop\1\src\LuaEngine\LuaEngine.cpp) C:\Program Files (x86)\Microsoft Visual Studio 12.0\VC\include\cinttypes 22 1 LuaEngine Error 346 error C2873: '_abs64' : symbol cannot be used in a using-declaration (C:\Users\Kenny\Desktop\1\src\LuaEngine\LuaEngine.cpp) C:\Program Files (x86)\Microsoft Visual Studio 12.0\VC\include\cinttypes 22 1 LuaEngine Error 347 error C2039: '_strtoi64' : is not a member of '`global namespace'' (C:\Users\Kenny\Desktop\1\src\LuaEngine\LuaEngine.cpp) C:\Program Files (x86)\Microsoft Visual Studio 12.0\VC\include\cinttypes 23 1 LuaEngine Error 348 error C2873: '_strtoi64' : symbol cannot be used in a using-declaration (C:\Users\Kenny\Desktop\1\src\LuaEngine\LuaEngine.cpp) C:\Program Files (x86)\Microsoft Visual Studio 12.0\VC\include\cinttypes 23 1 LuaEngine Error 349 error C2039: '_strtoui64' : is not a member of '`global namespace'' (C:\Users\Kenny\Desktop\1\src\LuaEngine\LuaEngine.cpp) C:\Program Files (x86)\Microsoft Visual Studio 12.0\VC\include\cinttypes 23 1 LuaEngine Error 350 error C2873: '_strtoui64' : symbol cannot be used in a using-declaration (C:\Users\Kenny\Desktop\1\src\LuaEngine\LuaEngine.cpp) C:\Program Files (x86)\Microsoft Visual Studio 12.0\VC\include\cinttypes 23 1 LuaEngine Error 351 error C2039: '_abs64' : is not a member of '`global namespace'' (C:\Users\Kenny\Desktop\1\src\LuaEngine\LuaFunctions.cpp) C:\Program Files (x86)\Microsoft Visual Studio 12.0\VC\include\cinttypes 22 1 LuaEngine Error 352 error C2873: '_abs64' : symbol cannot be used in a using-declaration (C:\Users\Kenny\Desktop\1\src\LuaEngine\LuaFunctions.cpp) C:\Program Files (x86)\Microsoft Visual Studio 12.0\VC\include\cinttypes 22 1 LuaEngine Error 353 error C2039: '_strtoi64' : is not a member of '`global namespace'' (C:\Users\Kenny\Desktop\1\src\LuaEngine\LuaFunctions.cpp) C:\Program Files (x86)\Microsoft Visual Studio 12.0\VC\include\cinttypes 23 1 LuaEngine Error 354 error C2873: '_strtoi64' : symbol cannot be used in a using-declaration (C:\Users\Kenny\Desktop\1\src\LuaEngine\LuaFunctions.cpp) C:\Program Files (x86)\Microsoft Visual Studio 12.0\VC\include\cinttypes 23 1 LuaEngine Error 355 error C2039: '_strtoui64' : is not a member of '`global namespace'' (C:\Users\Kenny\Desktop\1\src\LuaEngine\LuaFunctions.cpp) C:\Program Files (x86)\Microsoft Visual Studio 12.0\VC\include\cinttypes 23 1 LuaEngine Error 356 error C2873: '_strtoui64' : symbol cannot be used in a using-declaration (C:\Users\Kenny\Desktop\1\src\LuaEngine\LuaFunctions.cpp) C:\Program Files (x86)\Microsoft Visual Studio 12.0\VC\include\cinttypes 23 1 LuaEngine Error 357 error C2065: 'INTMAX_MAX' : undeclared identifier (C:\Users\Kenny\Desktop\1\src\LuaEngine\LuaEngine.cpp) C:\Program Files (x86)\Microsoft Visual Studio 12.0\VC\include\ratio 122 1 LuaEngine Error 358 error C2065: 'INTMAX_MAX' : undeclared identifier (C:\Users\Kenny\Desktop\1\src\LuaEngine\LuaEngine.cpp) C:\Program Files (x86)\Microsoft Visual Studio 12.0\VC\include\ratio 124 1 LuaEngine Error 359 error C2065: 'INTMAX_MAX' : undeclared identifier (C:\Users\Kenny\Desktop\1\src\LuaEngine\LuaEngine.cpp) C:\Program Files (x86)\Microsoft Visual Studio 12.0\VC\include\ratio 44 1 LuaEngine Error 360 error C2338: integer arithmetic overflow (C:\Users\Kenny\Desktop\1\src\LuaEngine\LuaEngine.cpp) C:\Program Files (x86)\Microsoft Visual Studio 12.0\VC\include\ratio 36 1 LuaEngine Error 361 error C2039: 'value' : is not a member of 'std::_Safe_multX<0x01,0x01,false>' (C:\Users\Kenny\Desktop\1\src\LuaEngine\LuaEngine.cpp) C:\Program Files (x86)\Microsoft Visual Studio 12.0\VC\include\ratio 44 1 LuaEngine Error 362 error C2065: 'value' : undeclared identifier (C:\Users\Kenny\Desktop\1\src\LuaEngine\LuaEngine.cpp) C:\Program Files (x86)\Microsoft Visual Studio 12.0\VC\include\ratio 44 1 LuaEngine Error 363 error C2057: expected constant expression (C:\Users\Kenny\Desktop\1\src\LuaEngine\LuaEngine.cpp) C:\Program Files (x86)\Microsoft Visual Studio 12.0\VC\include\ratio 44 1 LuaEngine Error 364 error C2039: 'value' : is not a member of 'std::_Safe_multX<0x01,0x0989680,false>' (C:\Users\Kenny\Desktop\1\src\LuaEngine\LuaEngine.cpp) C:\Program Files (x86)\Microsoft Visual Studio 12.0\VC\include\ratio 44 1 LuaEngine Error 365 error C2975: '_Nx' : invalid template argument for 'std::ratio', expected compile-time constant expression (C:\Users\Kenny\Desktop\1\src\LuaEngine\LuaEngine.cpp) C:\Program Files (x86)\Microsoft Visual Studio 12.0\VC\include\ratio 219 1 LuaEngine Error 366 error C2975: '_Dx' : invalid template argument for 'std::ratio', expected compile-time constant expression (C:\Users\Kenny\Desktop\1\src\LuaEngine\LuaEngine.cpp) C:\Program Files (x86)\Microsoft Visual Studio 12.0\VC\include\ratio 219 1 LuaEngine Error 367 error C2065: 'INTMAX_MAX' : undeclared identifier (C:\Users\Kenny\Desktop\1\src\LuaEngine\LuaFunctions.cpp) C:\Program Files (x86)\Microsoft Visual Studio 12.0\VC\include\ratio 122 1 LuaEngine Error 368 error C2065: 'INTMAX_MAX' : undeclared identifier (C:\Users\Kenny\Desktop\1\src\LuaEngine\LuaFunctions.cpp) C:\Program Files (x86)\Microsoft Visual Studio 12.0\VC\include\ratio 124 1 LuaEngine Error 369 error C2065: 'INTMAX_MAX' : undeclared identifier (C:\Users\Kenny\Desktop\1\src\LuaEngine\LuaFunctions.cpp) C:\Program Files (x86)\Microsoft Visual Studio 12.0\VC\include\ratio 44 1 LuaEngine Error 370 error C2338: integer arithmetic overflow (C:\Users\Kenny\Desktop\1\src\LuaEngine\LuaFunctions.cpp) C:\Program Files (x86)\Microsoft Visual Studio 12.0\VC\include\ratio 36 1 LuaEngine Error 371 error C2039: 'value' : is not a member of 'std::_Safe_multX<0x01,0x01,false>' (C:\Users\Kenny\Desktop\1\src\LuaEngine\LuaFunctions.cpp) C:\Program Files (x86)\Microsoft Visual Studio 12.0\VC\include\ratio 44 1 LuaEngine Error 372 error C2065: 'value' : undeclared identifier (C:\Users\Kenny\Desktop\1\src\LuaEngine\LuaFunctions.cpp) C:\Program Files (x86)\Microsoft Visual Studio 12.0\VC\include\ratio 44 1 LuaEngine Error 373 error C2057: expected constant expression (C:\Users\Kenny\Desktop\1\src\LuaEngine\LuaFunctions.cpp) C:\Program Files (x86)\Microsoft Visual Studio 12.0\VC\include\ratio 44 1 LuaEngine Error 374 error C2039: 'value' : is not a member of 'std::_Safe_multX<0x01,0x0989680,false>' (C:\Users\Kenny\Desktop\1\src\LuaEngine\LuaFunctions.cpp) C:\Program Files (x86)\Microsoft Visual Studio 12.0\VC\include\ratio 44 1 LuaEngine Error 375 error C2975: '_Nx' : invalid template argument for 'std::ratio', expected compile-time constant expression (C:\Users\Kenny\Desktop\1\src\LuaEngine\LuaFunctions.cpp) C:\Program Files (x86)\Microsoft Visual Studio 12.0\VC\include\ratio 219 1 LuaEngine Error 376 error C2975: '_Dx' : invalid template argument for 'std::ratio', expected compile-time constant expression (C:\Users\Kenny\Desktop\1\src\LuaEngine\LuaFunctions.cpp) C:\Program Files (x86)\Microsoft Visual Studio 12.0\VC\include\ratio 219 1 LuaEngine Error 377 error C2338: zero denominator (C:\Users\Kenny\Desktop\1\src\LuaEngine\LuaEngine.cpp) C:\Program Files (x86)\Microsoft Visual Studio 12.0\VC\include\ratio 121 1 LuaEngine Error 378 error C2338: zero denominator (C:\Users\Kenny\Desktop\1\src\LuaEngine\LuaFunctions.cpp) C:\Program Files (x86)\Microsoft Visual Studio 12.0\VC\include\ratio 121 1 LuaEngine
  10. Hello, compile the trinity but I get the following error I have no idea what causes this error Here I give you the logs please help! Archive_worldserver.exe_[23-12_15-14-10].txt Archive_worldserver.exe_[23-12_15-14-10].dmp
  11. Hi! I have an up-to-date 6.x build that was working fine until I tried opening wow_64_patched.exe today, I got error #134: "Unable to open DBFilesClient\MovieOverlays.dbc: Can't find file in build manifest" Could this be related to the update to 6.2.2 that happened earlier today? I wanted to post this here in case it was some silly mistake I made before I put it on the issue tracker. Thanks!
  12. 6.x

    Hello i compiled the latest version of TC 6.x, updated the database to TDB_full_6.02_2015_07_14 and created account with bnet account create ***** *****, but when i try to login the client gives me this error : Battle.net error #112 Unable to validate game version. My game version is 6.2.0(20201)(64x Release)(Patched). Why is that? The last database says that it supports 6.2.0