Jump to content
TrinityCore

Search the Community

Showing results for tags '3.3.5'.



More search options

  • Search By Tags

    Type tags separated by commas.
  • Search By Author

Content Type


Forums

  • General
    • Releases and Announcements
  • Help and Support
    • Help and Support
  • Offtopic
    • Trinitycore.org Website issues
    • Chillout Room

Find results in...

Find results that contain...


Date Created

  • Start

    End


Last Updated

  • Start

    End


Filter by number of...

Joined

  • Start

    End


Group


AIM


MSN


Website URL


ICQ


Yahoo


Jabber


Skype


Location


Interests

Found 25 results

  1. I'm having a problem with a number of factions not getting the flag "at war" in the reputation tab, and this is unable to be selected by the player. Currently, this is with The Oracles, as my character has their reputation with Frenzyheart. The problem occurs when one of two opposing factions is chosen as the positive reputation one. That said, Bloodsail Buccaneers seems to work fine. I did a search on how to fix this, and found this on the TrinityCore issues tracker: https://github.com/TrinityCore/TrinityCore/issues/9469 (specifically https://github.com/TrinityCore/TrinityCore/issues/9469#issuecomment-78925130) Do I just go into the ReputationManager.cpp file and edit it directly? I don't understand how the dbc/cpp files are used. Are they called by the client each time the client is started up? I found the code for ReputationManager.cpp here: https://github.com/TrinityCore/TrinityCore/blob/master/src/server/game/Reputation/ReputationMgr.cpp I don't understand how the fix goes into this code. I can see a Git pull (push?) whereas I thought I could just edit ReputationManager.cpp directly. If so, which lines do I replace (if any)? Otherwise, where should I insert the fix?
  2. Hello, Sorry if my question is not in the right category. Since a few days I started in TrinityCore v3.3.5, I currently encounter a small problem of which I still have a solution. I realized there was almost no titanium vein in icecrown. How can I implement them? Thanks for your help
  3. Hello Community, Through this channel, I would like to report an error finding of the emulator, for which I would like to know the real cause of the error. I leave the screenshot of the windows server 2012 R2 event viewer. Nombre de la aplicación con errores: worldserver.exe, versión: 0.0.0.0, marca de tiempo: 0x5b14917c Nombre del módulo con errores: worldserver.exe, versión: 0.0.0.0, marca de tiempo: 0x5b14917c Código de excepción: 0xc0000005 Desplazamiento de errores: 0x00000000014afabc Identificador del proceso con errores: 0xe4c Hora de inicio de la aplicación con errores: 0x01d406690386550f Ruta de acceso de la aplicación con errores: C:\WoWEmulator\worldserver.exe Ruta de acceso del módulo con errores: C:\WoWEmulator\worldserver.exe Identificador del informe: 2f24513a-7cb9-11e8-80ba-dc706f4dc3b8 Nombre completo del paquete con errores: Identificador de aplicación relativa del paquete con errores: That record has left the server. Stay tuned.
  4. I am currently trying to add another realm to my server. I have set up 2 new world and characters DB and copied SQL tables over from the first realm. I copied the first realm files (/server) and made a new folder called (/server2). I changed the worldserver.conf to new ports 8086 and added the new dbs to it. I've also tried to change the SOAP port from 7878 to 7879 and turning it off. When I turn on the worldserver for the second realm, it crashes and tells me it can't bind to port 7878 since it's in use from the first realm. I run auth and worldserver from the first server folder. I then try to run worldserver for the second realm and the error persists. I am running TC on latest SSL/TC core on Ubuntu 18 ---------------------------------------------------------------------------------------------------------------------------------------------------------------- I have also tried to cmake into the second realm folder (/server2) and I get greeted with this error: [email protected]:~/TrinityCore/build# make [ 4%] Built target g3dlib [ 4%] Built target Detour [ 5%] Built target Recast [ 6%] Built target fmt [ 9%] Built target jemalloc [ 9%] Built target gsoap [ 10%] Built target mpq [ 10%] Built target revision_data.h [ 14%] Built target common [ 14%] Building CXX object src/server/database/CMakeFiles/database.dir/Database/Implementation/CharacterDatabase.cpp.o fatal error: file '/usr/include/linux/limits.h' has been modified since the precompiled header '/root/TrinityCore/build/src/server/database/cotire/database_CXX_prefix.hxx.pch' was built note: please rebuild precompiled header '/root/TrinityCore/build/src/server/database/cotire/database_CXX_prefix.hxx.pch' 1 error generated. src/server/database/CMakeFiles/database.dir/build.make:427: recipe for target 'src/server/database/CMakeFiles/database.dir/Database/Implementation/CharacterDatabase.cpp.o' failed make[2]: *** [src/server/database/CMakeFiles/database.dir/Database/Implementation/CharacterDatabase.cpp.o] Error 1 CMakeFiles/Makefile2:1124: recipe for target 'src/server/database/CMakeFiles/database.dir/all' failed make[1]: *** [src/server/database/CMakeFiles/database.dir/all] Error 2 Makefile:129: recipe for target 'all' failed make: *** [all] Error 2 [email protected]:~/TrinityCore/build#
  5. Hi guys, i compiled my server under linux and i saw the thing about needing a connection patcher for my client (that needs to be compiled under windows) so i compiled my project on windows too but i can't find the connection patcher, it is nowhere to be seen !
  6. Server configuration. Ubunt-16,04-x86_64 CPU frequency 2400 MHz RAM 3072 MiB Number of processors 3 HDD 92160 MiB (8445 MiB is used) Traffic is unlimited. 100mb channel ========================== Created the server. Online ran 7 bodies (including me) at all stable ping 50-70 There is almost no load on the servo. Busy almost always 500MB of RAM from 3g. I start the server through the screen. What changed. Made server currency through the already available. I deleted the square that gave this currency. Sometimes when you learn skills, there is a pause in 1 second or even 5. The whole server complains that there are jams. Assembling off Trinity. As I understood the last revision. I compiled everything myself! I also tuned everything myself. In TrinityAdmin sometimes shows an update of Diff under 2k is this the norm? Tell me where to pick? Strange server logs Spell Id 6940 has DBC ProcFlags 699048, but it's of non-proc aura type, it probably needs an entry in `spell_proc` table to be handled correctly. Spell Id 7366 has DBC ProcFlags 69972, but it's of non-proc aura type, it probably needs an entry in `spell_proc` table to be handled correctly. Spell Id 18499 has DBC ProcFlags 139944, but it's of non-proc aura type, it probably needs an entry in `spell_proc` table to be handled correctly. Spell Id 28313 has DBC ProcFlags 1581224, but it's of non-proc aura type, it probably needs an entry in `spell_proc` table to be handled correctly. Spell Id 32065 has DBC ProcFlags 262144, but it's of non-proc aura type, it probably needs an entry in `spell_proc` table to be handled correctly. Spell Id 33891 has DBC ProcFlags 174624, but it's of non-proc aura type, it probably needs an entry in `spell_proc` table to be handled correctly. Spell Id 35244 has DBC ProcFlags 262144, but it's of non-proc aura type, it probably needs an entry in `spell_proc` table to be handled correctly. Spell Id 36659 has DBC ProcFlags 262144, but it's of non-proc aura type, it probably needs an entry in `spell_proc` table to be handled correctly. Spell Id 40453 has DBC ProcFlags 1581224, but it's of non-proc aura type, it probably needs an entry in `spell_proc` table to be handled correctly. Spell Id 40879 has DBC ProcFlags 664096, but it's of non-proc aura type, it probably needs an entry in `spell_proc` table to be handled correctly. Spell Id 41341 has DBC ProcFlags 1747624, but it's of non-proc aura type, it probably needs an entry in `spell_proc` table to be handled correctly. Spell Id 44586 has DBC ProcFlags 697000, but it's of non-proc aura type, it probably needs an entry in `spell_proc` table to be handled correctly. Spell Id 45092 has DBC ProcFlags 664232, but it's of non-proc aura type, it probably needs an entry in `spell_proc` table to be handled correctly. Spell Id 49145 has DBC ProcFlags 131072, but it's of non-proc aura type, it probably needs an entry in `spell_proc` table to be handled correctly. Spell Id 50462 has DBC ProcFlags 131752, but it's of non-proc aura type, it probably needs an entry in `spell_proc` table to be handled correctly. Spell Id 50498 has DBC ProcFlags 16, but it's of non-proc aura type, it probably needs an entry in `spell_proc` table to be handled correctly. Spell Id 51809 has DBC ProcFlags 131752, but it's of non-proc aura type, it probably needs an entry in `spell_proc` table to be handled correctly. Spell Id 53032 has DBC ProcFlags 81936, but it's of non-proc aura type, it probably needs an entry in `spell_proc` table to be handled correctly. Spell Id 53578 has DBC ProcFlags 16, but it's of non-proc aura type, it probably needs an entry in `spell_proc` table to be handled correctly. Spell Id 53579 has DBC ProcFlags 16, but it's of non-proc aura type, it probably needs an entry in `spell_proc` table to be handled correctly. Spell Id 53580 has DBC ProcFlags 16, but it's of non-proc aura type, it probably needs an entry in `spell_proc` table to be handled correctly. Spell Id 53581 has DBC ProcFlags 16, but it's of non-proc aura type, it probably needs an entry in `spell_proc` table to be handled correctly. Spell Id 53582 has DBC ProcFlags 16, but it's of non-proc aura type, it probably needs an entry in `spell_proc` table to be handled correctly. Spell Id 62142 has DBC ProcFlags 69648, but it's of non-proc aura type, it probably needs an entry in `spell_proc` table to be handled correctly. Spell Id 64205 has DBC ProcFlags 699048, but it's of non-proc aura type, it probably needs an entry in `spell_proc` table to be handled correctly. Spell Id 66334 has DBC ProcFlags 245760, but it's of non-proc aura type, it probably needs an entry in `spell_proc` table to be handled correctly. Spell Id 67905 has DBC ProcFlags 245760, but it's of non-proc aura type, it probably needs an entry in `spell_proc` table to be handled correctly. Spell Id 67906 has DBC ProcFlags 245760, but it's of non-proc aura type, it probably needs an entry in `spell_proc` table to be handled correctly. Spell Id 67907 has DBC ProcFlags 245760, but it's of non-proc aura type, it probably needs an entry in `spell_proc` table to be handled correctly. Spell Id 72151 has DBC ProcFlags 69972, but it's of non-proc aura type, it probably needs an entry in `spell_proc` table to be handled correctly. Spell Id 72648 has DBC ProcFlags 69972, but it's of non-proc aura type, it probably needs an entry in `spell_proc` table to be handled correctly. Spell Id 72649 has DBC ProcFlags 69972, but it's of non-proc aura type, it probably needs an entry in `spell_proc` table to be handled correctly. Spell Id 72650 has DBC ProcFlags 69972, but it's of non-proc aura type, it probably needs an entry in `spell_proc` table to be handled correctly. Item (Entry: 5828) has wrong (non-existing?) stat_type1 (51) Item (Entry: 5828) has wrong (non-existing?) stat_type2 (52) Item (Entry: 5828) has wrong (non-existing?) stat_type3 (54) Item (Entry: 5828) has wrong (non-existing?) stat_type4 (56) Item (Entry: 5828) has wrong (non-existing?) stat_type5 (55) Item (Entry: 17802) has wrong (non-existing?) stat_type3 (51) Item (Entry: 17802) has wrong (non-existing?) stat_type4 (55) Item (Entry: 18881) has wrong (non-existing?) stat_type3 (51) Item (Entry: 19065) has wrong (non-existing?) stat_type3 (50) Item (Entry: 19158) has wrong (non-existing?) stat_type3 (51) Item (Entry: 20142) has wrong (non-existing?) stat_type3 (50) Item (Entry: 20142) has wrong (non-existing?) stat_type4 (51) Item (Entry: 20142) has wrong (non-existing?) stat_type5 (52) Item (Entry: 20142) has wrong (non-existing?) stat_type6 (54) Item (Entry: 20142) has wrong (non-existing?) stat_type7 (56) Item (Entry: 20142) has wrong (non-existing?) stat_type8 (55) Item (Entry: 20522) has wrong (non-existing?) stat_type3 (50) Item (Entry: 20524) has wrong (non-existing?) stat_type3 (50) Item (Entry: 20524) has wrong (non-existing?) stat_type4 (54) Item (Entry: 21614) has wrong (non-existing?) stat_type3 (55) Item (Entry: 22230) has wrong (non-existing?) stat_type2 (50) Item (Entry: 23362) has wrong (non-existing?) stat_type5 (50) Item (Entry: 23362) has wrong (non-existing?) stat_type6 (51) Item (Entry: 23362) has wrong (non-existing?) stat_type7 (54) Item (Entry: 23363) has wrong (non-existing?) stat_type5 (55) Item (Entry: 23363) has wrong (non-existing?) stat_type6 (56) Item (Entry: 32113) has wrong (non-existing?) stat_type5 (50) Item (Entry: 32114) has wrong (non-existing?) stat_type5 (50) Item (Entry: 32115) has wrong (non-existing?) stat_type5 (50) Item (Entry: 32116) has wrong (non-existing?) stat_type5 (50) Item (Entry: 32117) has wrong (non-existing?) stat_type5 (50) Item (Entry: 32118) has wrong (non-existing?) stat_type5 (50) Item (Entry: 32119) has wrong (non-existing?) stat_type5 (50) Item (Entry: 32121) has wrong (non-existing?) stat_type5 (50) Item (Entry: 32122) has wrong (non-existing?) stat_type5 (50) Item (Entry: 32123) has wrong (non-existing?) stat_type5 (50) Item (Entry: 32128) has wrong (non-existing?) stat_type5 (50) Item (Entry: 32129) has wrong (non-existing?) stat_type5 (50) Item (Entry: 32130) has wrong (non-existing?) stat_type5 (50) Item (Entry: 32131) has wrong (non-existing?) stat_type5 (50) Item (Entry: 32132) has wrong (non-existing?) stat_type5 (50) Item (Entry: 34187) has wrong (non-existing?) stat_type1 (50) Item (Entry: 34967) has deprecated stat_type4 (41) Item (Entry: 34967) has deprecated stat_type5 (42) Item (Entry: 36942) does not have a correct SoundOverrideSubclass (-1), must be 8 . Item (Entry: 36942) does not have a correct material (1), must be -1 . Item (Entry: 36942) does not have a correct display id (65153), must be 46609 . Item (Entry: 40762) has wrong (non-existing?) stat_type5 (51) Item (Entry: 45860) has wrong (non-existing?) stat_type1 (50) Item (Entry: 48945) has wrong (non-existing?) stat_type2 (50) Item (Entry: 49312) has wrong (non-existing?) stat_type3 (51) Item (Entry: 49314) has wrong (non-existing?) stat_type5 (51) Creature template (Entry: 50100) does not exist but has a record in `creature_equip_template` Table `creature` has creature (GUID: 213876) with non existing creature entry 50100, skipped. Table `creature` has creature (GUID: 213896 Entry: 36597) with `creature_template`.`flags_extra` including CREATURE_FLAG_EXTRA_INSTANCE_BIND but creature is not in instance. Table `creature_queststarter`: Quest 12170 listed for entry 27120 does not exist. Table `creature_queststarter`: Quest 12443 listed for entry 27495 does not exist. Table `creature_queststarter`: Quest 12314 listed for entry 27520 does not exist. Table `creature_queststarter`: Quest 12315 listed for entry 27532 does not exist. Table `creature_queststarter`: Quest 12317 listed for entry 27563 does not exist. Table `creature_queststarter`: Quest 12323 listed for entry 27602 does not exist. Table `creature_queststarter`: Quest 12432 listed for entry 27708 does not exist. Table `creature_queststarter`: Quest 12444 listed for entry 27783 does not exist. Table `creature_questender`: Quest 12170 listed for entry 27120 does not exist. Table `creature_questender`: Quest 12443 listed for entry 27495 does not exist. Table `creature_questender`: Quest 12314 listed for entry 27520 does not exist. Table `creature_questender`: Quest 12315 listed for entry 27532 does not exist. Table `creature_questender`: Quest 12317 listed for entry 27563 does not exist. Table `creature_questender`: Quest 12323 listed for entry 27602 does not exist. Table `creature_questender`: Quest 12432 listed for entry 27708 does not exist. Table `creature_questender`: Quest 12444 listed for entry 27783 does not exist. Table 'creature_loot_template' Entry 50100 isn't creature entry and not referenced from loot, and thus useless. Table 'item_loot_template' Entry 50100 isn't item entry and not referenced from loot, and thus useless. [Condition SourceType: 4 (GameObject Loot), SourceGroup: 24095, SourceEntry: 37664, ConditionType: 9 (Quest Taken)] points to non-existing quest (12434), skipped. [Condition SourceType: 4 (GameObject Loot), SourceGroup: 24095, SourceEntry: 37664, ConditionType: 9 (Quest Taken)] points to non-existing quest (12443), skipped. [Condition SourceType: 4 (GameObject Loot), SourceGroup: 24095, SourceEntry: 37664, ConditionType: 9 (Quest Taken)] points to non-existing quest (12432), skipped. Quest 12323 (alliance_id) referenced in `player_factionchange_quests` does not exist, pair skipped! SQL(p): INSERT INTO character_queststatus_seasonal (guid, quest, event) VALUES (70, 11915, 1) [ERROR]: [1062] Duplicate entry '70-11915' for key 'PRIMARY' SQL(p): INSERT INTO character_queststatus_seasonal (guid, quest, event) VALUES (70, 11915, 1) [ERROR]: [1062] Duplicate entry '70-11915' for key 'PRIMARY' Spell Id 6940 has DBC ProcFlags 699048, but it's of non-proc aura type, it probably needs an entry in `spell_proc` table to be handled correctly. Spell Id 7366 has DBC ProcFlags 69972, but it's of non-proc aura type, it probably needs an entry in `spell_proc` table to be handled correctly. Spell Id 18499 has DBC ProcFlags 139944, but it's of non-proc aura type, it probably needs an entry in `spell_proc` table to be handled correctly. Spell Id 28313 has DBC ProcFlags 1581224, but it's of non-proc aura type, it probably needs an entry in `spell_proc` table to be handled correctly. Spell Id 32065 has DBC ProcFlags 262144, but it's of non-proc aura type, it probably needs an entry in `spell_proc` table to be handled correctly. Spell Id 33891 has DBC ProcFlags 174624, but it's of non-proc aura type, it probably needs an entry in `spell_proc` table to be handled correctly. Spell Id 35244 has DBC ProcFlags 262144, but it's of non-proc aura type, it probably needs an entry in `spell_proc` table to be handled correctly. Spell Id 36659 has DBC ProcFlags 262144, but it's of non-proc aura type, it probably needs an entry in `spell_proc` table to be handled correctly. Spell Id 40453 has DBC ProcFlags 1581224, but it's of non-proc aura type, it probably needs an entry in `spell_proc` table to be handled correctly. Spell Id 40879 has DBC ProcFlags 664096, but it's of non-proc aura type, it probably needs an entry in `spell_proc` table to be handled correctly. Spell Id 41341 has DBC ProcFlags 1747624, but it's of non-proc aura type, it probably needs an entry in `spell_proc` table to be handled correctly. Spell Id 44586 has DBC ProcFlags 697000, but it's of non-proc aura type, it probably needs an entry in `spell_proc` table to be handled correctly. Spell Id 45092 has DBC ProcFlags 664232, but it's of non-proc aura type, it probably needs an entry in `spell_proc` table to be handled correctly. Spell Id 49145 has DBC ProcFlags 131072, but it's of non-proc aura type, it probably needs an entry in `spell_proc` table to be handled correctly. Spell Id 50462 has DBC ProcFlags 131752, but it's of non-proc aura type, it probably needs an entry in `spell_proc` table to be handled correctly. Spell Id 50498 has DBC ProcFlags 16, but it's of non-proc aura type, it probably needs an entry in `spell_proc` table to be handled correctly. Spell Id 51809 has DBC ProcFlags 131752, but it's of non-proc aura type, it probably needs an entry in `spell_proc` table to be handled correctly. Spell Id 53032 has DBC ProcFlags 81936, but it's of non-proc aura type, it probably needs an entry in `spell_proc` table to be handled correctly. Spell Id 53578 has DBC ProcFlags 16, but it's of non-proc aura type, it probably needs an entry in `spell_proc` table to be handled correctly. Spell Id 53579 has DBC ProcFlags 16, but it's of non-proc aura type, it probably needs an entry in `spell_proc` table to be handled correctly. Spell Id 53580 has DBC ProcFlags 16, but it's of non-proc aura type, it probably needs an entry in `spell_proc` table to be handled correctly. Spell Id 53581 has DBC ProcFlags 16, but it's of non-proc aura type, it probably needs an entry in `spell_proc` table to be handled correctly. Spell Id 53582 has DBC ProcFlags 16, but it's of non-proc aura type, it probably needs an entry in `spell_proc` table to be handled correctly. Spell Id 62142 has DBC ProcFlags 69648, but it's of non-proc aura type, it probably needs an entry in `spell_proc` table to be handled correctly. Spell Id 64205 has DBC ProcFlags 699048, but it's of non-proc aura type, it probably needs an entry in `spell_proc` table to be handled correctly. Spell Id 66334 has DBC ProcFlags 245760, but it's of non-proc aura type, it probably needs an entry in `spell_proc` table to be handled correctly. Spell Id 67905 has DBC ProcFlags 245760, but it's of non-proc aura type, it probably needs an entry in `spell_proc` table to be handled correctly. Spell Id 67906 has DBC ProcFlags 245760, but it's of non-proc aura type, it probably needs an entry in `spell_proc` table to be handled correctly. Spell Id 67907 has DBC ProcFlags 245760, but it's of non-proc aura type, it probably needs an entry in `spell_proc` table to be handled correctly. Spell Id 72151 has DBC ProcFlags 69972, but it's of non-proc aura type, it probably needs an entry in `spell_proc` table to be handled correctly. Spell Id 72648 has DBC ProcFlags 69972, but it's of non-proc aura type, it probably needs an entry in `spell_proc` table to be handled correctly. Spell Id 72649 has DBC ProcFlags 69972, but it's of non-proc aura type, it probably needs an entry in `spell_proc` table to be handled correctly. Spell Id 72650 has DBC ProcFlags 69972, but it's of non-proc aura type, it probably needs an entry in `spell_proc` table to be handled correctly. Item (Entry: 5828) has wrong (non-existing?) stat_type1 (51) Item (Entry: 5828) has wrong (non-existing?) stat_type2 (52) Item (Entry: 5828) has wrong (non-existing?) stat_type3 (54) Item (Entry: 5828) has wrong (non-existing?) stat_type4 (56) Item (Entry: 5828) has wrong (non-existing?) stat_type5 (55) Item (Entry: 17802) has wrong (non-existing?) stat_type3 (51) Item (Entry: 17802) has wrong (non-existing?) stat_type4 (55) Item (Entry: 18881) has wrong (non-existing?) stat_type3 (51) Item (Entry: 19065) has wrong (non-existing?) stat_type3 (50) Item (Entry: 19158) has wrong (non-existing?) stat_type3 (51) Item (Entry: 20142) has wrong (non-existing?) stat_type3 (50) Item (Entry: 20142) has wrong (non-existing?) stat_type4 (51) Item (Entry: 20142) has wrong (non-existing?) stat_type5 (52) Item (Entry: 20142) has wrong (non-existing?) stat_type6 (54) Item (Entry: 20142) has wrong (non-existing?) stat_type7 (56) Item (Entry: 20142) has wrong (non-existing?) stat_type8 (55) Item (Entry: 20522) has wrong (non-existing?) stat_type3 (50) Item (Entry: 20524) has wrong (non-existing?) stat_type3 (50) Item (Entry: 20524) has wrong (non-existing?) stat_type4 (54) Item (Entry: 21614) has wrong (non-existing?) stat_type3 (55) Item (Entry: 22230) has wrong (non-existing?) stat_type2 (50) Item (Entry: 23362) has wrong (non-existing?) stat_type5 (50) Item (Entry: 23362) has wrong (non-existing?) stat_type6 (51) Item (Entry: 23362) has wrong (non-existing?) stat_type7 (54) Item (Entry: 23363) has wrong (non-existing?) stat_type5 (55) Item (Entry: 23363) has wrong (non-existing?) stat_type6 (56) Item (Entry: 32113) has wrong (non-existing?) stat_type5 (50) Item (Entry: 32114) has wrong (non-existing?) stat_type5 (50) Item (Entry: 32115) has wrong (non-existing?) stat_type5 (50) Item (Entry: 32116) has wrong (non-existing?) stat_type5 (50) Item (Entry: 32117) has wrong (non-existing?) stat_type5 (50) Item (Entry: 32118) has wrong (non-existing?) stat_type5 (50) Item (Entry: 32119) has wrong (non-existing?) stat_type5 (50) Item (Entry: 32121) has wrong (non-existing?) stat_type5 (50) Item (Entry: 32122) has wrong (non-existing?) stat_type5 (50) Item (Entry: 32123) has wrong (non-existing?) stat_type5 (50) Item (Entry: 32128) has wrong (non-existing?) stat_type5 (50) Item (Entry: 32129) has wrong (non-existing?) stat_type5 (50) Item (Entry: 32130) has wrong (non-existing?) stat_type5 (50) Item (Entry: 32131) has wrong (non-existing?) stat_type5 (50) Item (Entry: 32132) has wrong (non-existing?) stat_type5 (50) Item (Entry: 34187) has wrong (non-existing?) stat_type1 (50) Item (Entry: 34967) has deprecated stat_type4 (41) Item (Entry: 34967) has deprecated stat_type5 (42) Item (Entry: 36942) does not have a correct SoundOverrideSubclass (-1), must be 8 . Item (Entry: 36942) does not have a correct material (1), must be -1 . Item (Entry: 36942) does not have a correct display id (65153), must be 46609 . Item (Entry: 40762) has wrong (non-existing?) stat_type5 (51) Item (Entry: 45860) has wrong (non-existing?) stat_type1 (50) Item (Entry: 48945) has wrong (non-existing?) stat_type2 (50) Item (Entry: 49312) has wrong (non-existing?) stat_type3 (51) Item (Entry: 49314) has wrong (non-existing?) stat_type5 (51) Creature template (Entry: 50100) does not exist but has a record in `creature_equip_template` Table `creature` has creature (GUID: 213876) with non existing creature entry 50100, skipped. Table `creature_queststarter`: Quest 12170 listed for entry 27120 does not exist. Table `creature_queststarter`: Quest 12443 listed for entry 27495 does not exist. Table `creature_queststarter`: Quest 12314 listed for entry 27520 does not exist. Table `creature_queststarter`: Quest 12315 listed for entry 27532 does not exist. Table `creature_queststarter`: Quest 12317 listed for entry 27563 does not exist. Table `creature_queststarter`: Quest 12323 listed for entry 27602 does not exist. Table `creature_queststarter`: Quest 12432 listed for entry 27708 does not exist. Table `creature_queststarter`: Quest 12444 listed for entry 27783 does not exist. Table `creature_questender`: Quest 12170 listed for entry 27120 does not exist. Table `creature_questender`: Quest 12443 listed for entry 27495 does not exist. Table `creature_questender`: Quest 12314 listed for entry 27520 does not exist. Table `creature_questender`: Quest 12315 listed for entry 27532 does not exist. Table `creature_questender`: Quest 12317 listed for entry 27563 does not exist. Table `creature_questender`: Quest 12323 listed for entry 27602 does not exist. Table `creature_questender`: Quest 12432 listed for entry 27708 does not exist. Table `creature_questender`: Quest 12444 listed for entry 27783 does not exist. Table 'item_loot_template' Entry 50100 isn't item entry and not referenced from loot, and thus useless. [Condition SourceType: 4 (GameObject Loot), SourceGroup: 24095, SourceEntry: 37664, ConditionType: 9 (Quest Taken)] points to non-existing quest (12434), skipped. [Condition SourceType: 4 (GameObject Loot), SourceGroup: 24095, SourceEntry: 37664, ConditionType: 9 (Quest Taken)] points to non-existing quest (12443), skipped. [Condition SourceType: 4 (GameObject Loot), SourceGroup: 24095, SourceEntry: 37664, ConditionType: 9 (Quest Taken)] points to non-existing quest (12432), skipped. Quest 12323 (alliance_id) referenced in `player_factionchange_quests` does not exist, pair skipped! SQL(p): INSERT INTO character_queststatus_seasonal (guid, quest, event) VALUES (31, 11882, 1) [ERROR]: [1062] Duplicate entry '31-11882' for key 'PRIMARY'
  7. I've run my own TC 3.3.5 server on Ubuntu for some time for just playing around on. Recently I discovered more difficulty rebuilding it though. ...so I put a little effort into a little Dockerised automated build as a fall-back plan in case I could no longer build and run it on my preferred host. I thought I would share it here in case anybody else finds it useful. * https://github.com/neechbear/trinitycore * https://github.com/neechbear/trinitycore/blob/master/GettingStarted.md Comments and contributions are welcomed.
  8. Hi all! I have few question about Trinity in "general", and about Isle of Conquest. I have already installed Trinity (3.3.5b for starters), and as i see IoC didn't work (i see timer 2:30:00 thats all). As i see on github there is a branch "3.3.5 battleground rewrite". I want to test it tomorrow, but maybe someone can say something about it? How it works? Or its a "dev" branch and works unstable? If it works good, can i merge it manually or maybe already exists some "magical" commands to apply this "patch" to 3.3.5b main branch? I am learning C++ and love wow, and for me its a super new experience so don`t beat me What is a general problem exist now in Trinity? I mean maybe some Battlegrounds works very bad, or maybe arena, or PVE Instance on 70-80 lvl? Where is a worst places in Trinity? Its impossible to read all issues, but its possible to ask you as people with experience which work and play on it many years or maybe? Another question, about "Anti-Cheat", as i know cheats works very well on many TOP-Public servers like WowCircle, or Dalaran-WoW. Btw i dont know any servers where "Gagarin" didnt work (maybe there is another custom core or cmangos or something else... but it works very well...so it exist "Antichit" or now? And how i can enable and use it? Sorry for many questions. And sorry for my bad english. BTW: soon i give to many good bug reports (ofc not duplicate) about 3.3.5b.
  9. For a very long time i've tried to figure out how MiscValue works in spell.dbc, but no matter what i always run into a wall and no one knows. Now i wanna learn how you find the misc value for a spell. Lets say i have a spell that increases critical strike, i want to know what the misc id is for this and where it can be found, or attack speed. Pretty much what im trying to do is a spell that increases overall crit chance in % and to do that i need the misc Value.
  10. Hello, I'm wondering if there is a program to allow me to view the spell.db file, After looking at "how to fix spells" guides It mentions I have to enter my spell.db file, But without an editor or a file that allows me to open this file, Its kind of difficult. If anyone could post a link to a program that will allow me to do so, I'd be grateful. Thank you.
  11. I don't know if this is a bug (or a bug that can be easily fixed) but if you are in game and set your health/energy to a number. i..e .mod hp/energy xxx, when you level or have a debuff applied to you the hp/energy is reset to the normal values dependent on level and armor that you are currently wearing. obviously this doesnt bode well when fighting a boss or whatever. Wanted to see if there was currently something to prevent this from happening?
  12. testing out northshire area for human and all the quests so far - all the mobs appear to be neutral (see screenshots). Shouldn't they be aggressive to attack on site?
  13. I am trying to insert some bags into my equipped slots and for some reason its not working. http://www.wowhead.com/item=23162/forors-crate-of-endless-resist-gear-storage Please see screenshots to where I can locate them into the database and using https://trinitycore.atlassian.net/wiki/display/tc/character_inventory# for the docs. Here I attempt to put this item into slot 20 in my character_inventory table with the unique key from wowhead and from the database. When i launch the game the only bag i have is the default backpack. Any help would be appreciated. thanks!
  14. Is there a comprehensive 3.3.5 list of boss ids with their name counterparts? I couldn't find it in the database at all. I find it odd that the 'Creature' table doesnt include it. Where are the names stored for their respective unique id? I am wanting to play around with the boss hp and loot tables(increase percentage of certain drops). Incidentally i see the creature_loot_template table but don't see how thats tied to any particular mob. How do you look at the db and tie loot drops to bosses?
  15. Just got everything working and running properly! woot! But there is an issue - there is no subtlety tab in the character pane(please see screenshot) and as a result (assuming) i cannot stealth. Any pointers on whats going on here?
  16. Hello, im trying to change the Text that a boss say when u enter in the room. For Example when u enter in Lord Marrowgar room, he say something like: Hello im ur father.. I already change the text in the creature_text & broadcast_text but it still showing the Default Msg. and in the console i get this error: "DoZoneInCombat called for creature that has empty threat list (creature entry = 36612)".. Obviously the String of the chat is filled with "Hello im ur father." Any idea? Thanks. Solved.
  17. Hey there, I am trying to compile a fresh copy of 3.3.5 TC but it will not work. I have very little knowledge in this area and thus I am asking for help after trying to figure it out for 2 days. I am using Visual Studio 13 with update 5. I am have tried using boost 1.59 as well as 1.60 for visual studio 2013. I am running Windows 10. I have also tried compiling with Visual Studio 10 but same problem. Basically I clone the latest revision, run it through cMake, configure, generate and so on, and that part works just fine, the problem is the actual compiling. All the programs I have been using are for 32 bit systems although I run 64 bit. The error list is very long and most of the time it's the same one several times, but in different parts of the process. My question is how do I fix this issue? Error 1 error C2039: '_abs64' : is not a member of '`global namespace'' C:\Program Files (x86)\Microsoft Visual Studio 12.0\VC\include\cinttypes 22 1 game Error 2 error C2873: '_abs64' : symbol cannot be used in a using-declaration C:\Program Files (x86)\Microsoft Visual Studio 12.0\VC\include\cinttypes 22 1 game Error 3 error C2039: '_strtoi64' : is not a member of '`global namespace'' C:\Program Files (x86)\Microsoft Visual Studio 12.0\VC\include\cinttypes 23 1 game Error 4 error C2873: '_strtoi64' : symbol cannot be used in a using-declaration C:\Program Files (x86)\Microsoft Visual Studio 12.0\VC\include\cinttypes 23 1 game Error 5 error C2039: '_strtoui64' : is not a member of '`global namespace'' C:\Program Files (x86)\Microsoft Visual Studio 12.0\VC\include\cinttypes 23 1 game Error 6 error C2873: '_strtoui64' : symbol cannot be used in a using-declaration C:\Program Files (x86)\Microsoft Visual Studio 12.0\VC\include\cinttypes 23 1 game Error 7 error C2039: '_abs64' : is not a member of '`global namespace'' C:\Program Files (x86)\Microsoft Visual Studio 12.0\VC\include\cinttypes 22 1 common Error 8 error C2873: '_abs64' : symbol cannot be used in a using-declaration C:\Program Files (x86)\Microsoft Visual Studio 12.0\VC\include\cinttypes 22 1 common Error 9 error C2039: '_strtoi64' : is not a member of '`global namespace'' C:\Program Files (x86)\Microsoft Visual Studio 12.0\VC\include\cinttypes 23 1 common Error 10 error C2873: '_strtoi64' : symbol cannot be used in a using-declaration C:\Program Files (x86)\Microsoft Visual Studio 12.0\VC\include\cinttypes 23 1 common Error 11 error C2039: '_strtoui64' : is not a member of '`global namespace'' C:\Program Files (x86)\Microsoft Visual Studio 12.0\VC\include\cinttypes 23 1 common Error 12 error C2873: '_strtoui64' : symbol cannot be used in a using-declaration C:\Program Files (x86)\Microsoft Visual Studio 12.0\VC\include\cinttypes 23 1 common Error 13 error C2065: 'INTMAX_MAX' : undeclared identifier C:\Program Files (x86)\Microsoft Visual Studio 12.0\VC\include\ratio 122 1 game Error 14 error C2065: 'INTMAX_MAX' : undeclared identifier C:\Program Files (x86)\Microsoft Visual Studio 12.0\VC\include\ratio 124 1 game Error 15 error C2065: 'INTMAX_MAX' : undeclared identifier C:\Program Files (x86)\Microsoft Visual Studio 12.0\VC\include\ratio 44 1 game Error 16 error C2338: integer arithmetic overflow C:\Program Files (x86)\Microsoft Visual Studio 12.0\VC\include\ratio 36 1 game Error 17 error C2039: 'value' : is not a member of 'std::_Safe_multX<0x01,0x01,false>' C:\Program Files (x86)\Microsoft Visual Studio 12.0\VC\include\ratio 44 1 game Error 18 error C2065: 'value' : undeclared identifier C:\Program Files (x86)\Microsoft Visual Studio 12.0\VC\include\ratio 44 1 game Error 19 error C2057: expected constant expression C:\Program Files (x86)\Microsoft Visual Studio 12.0\VC\include\ratio 44 1 game Error 20 error C2039: 'value' : is not a member of 'std::_Safe_multX<0x01,0x0989680,false>' C:\Program Files (x86)\Microsoft Visual Studio 12.0\VC\include\ratio 44 1 game Error 21 error C2975: '_Nx' : invalid template argument for 'std::ratio', expected compile-time constant expression C:\Program Files (x86)\Microsoft Visual Studio 12.0\VC\include\ratio 219 1 game Error 22 error C2975: '_Dx' : invalid template argument for 'std::ratio', expected compile-time constant expression C:\Program Files (x86)\Microsoft Visual Studio 12.0\VC\include\ratio 219 1 game Error 23 error C2065: 'INTMAX_MAX' : undeclared identifier C:\Program Files (x86)\Microsoft Visual Studio 12.0\VC\include\ratio 122 1 database Error 24 error C2065: 'INTMAX_MAX' : undeclared identifier C:\Program Files (x86)\Microsoft Visual Studio 12.0\VC\include\ratio 124 1 database Error 25 error C2065: 'INTMAX_MAX' : undeclared identifier C:\Program Files (x86)\Microsoft Visual Studio 12.0\VC\include\ratio 44 1 database Error 26 error C2338: integer arithmetic overflow C:\Program Files (x86)\Microsoft Visual Studio 12.0\VC\include\ratio 36 1 database Error 27 error C2039: 'value' : is not a member of 'std::_Safe_multX<0x01,0x01,false>' C:\Program Files (x86)\Microsoft Visual Studio 12.0\VC\include\ratio 44 1 database Error 28 error C2065: 'value' : undeclared identifier C:\Program Files (x86)\Microsoft Visual Studio 12.0\VC\include\ratio 44 1 database Error 29 error C2057: expected constant expression C:\Program Files (x86)\Microsoft Visual Studio 12.0\VC\include\ratio 44 1 database Error 30 error C2039: 'value' : is not a member of 'std::_Safe_multX<0x01,0x0989680,false>' C:\Program Files (x86)\Microsoft Visual Studio 12.0\VC\include\ratio 44 1 database Error 31 error C2975: '_Nx' : invalid template argument for 'std::ratio', expected compile-time constant expression C:\Program Files (x86)\Microsoft Visual Studio 12.0\VC\include\ratio 219 1 database Error 32 error C2975: '_Dx' : invalid template argument for 'std::ratio', expected compile-time constant expression C:\Program Files (x86)\Microsoft Visual Studio 12.0\VC\include\ratio 219 1 database Error 33 error C2065: 'INTMAX_MAX' : undeclared identifier C:\Program Files (x86)\Microsoft Visual Studio 12.0\VC\include\ratio 122 1 common Error 34 error C2065: 'INTMAX_MAX' : undeclared identifier C:\Program Files (x86)\Microsoft Visual Studio 12.0\VC\include\ratio 124 1 common Error 35 error C2065: 'INTMAX_MAX' : undeclared identifier C:\Program Files (x86)\Microsoft Visual Studio 12.0\VC\include\ratio 44 1 common Error 36 error C2338: integer arithmetic overflow C:\Program Files (x86)\Microsoft Visual Studio 12.0\VC\include\ratio 36 1 common Error 37 error C2039: 'value' : is not a member of 'std::_Safe_multX<0x01,0x01,false>' C:\Program Files (x86)\Microsoft Visual Studio 12.0\VC\include\ratio 44 1 common Error 38 error C2065: 'value' : undeclared identifier C:\Program Files (x86)\Microsoft Visual Studio 12.0\VC\include\ratio 44 1 common Error 39 error C2057: expected constant expression C:\Program Files (x86)\Microsoft Visual Studio 12.0\VC\include\ratio 44 1 common Error 40 error C2039: 'value' : is not a member of 'std::_Safe_multX<0x01,0x0989680,false>' C:\Program Files (x86)\Microsoft Visual Studio 12.0\VC\include\ratio 44 1 common Error 41 error C2975: '_Nx' : invalid template argument for 'std::ratio', expected compile-time constant expression C:\Program Files (x86)\Microsoft Visual Studio 12.0\VC\include\ratio 219 1 common Error 42 error C2975: '_Dx' : invalid template argument for 'std::ratio', expected compile-time constant expression C:\Program Files (x86)\Microsoft Visual Studio 12.0\VC\include\ratio 219 1 common Error 43 error C2338: zero denominator C:\Program Files (x86)\Microsoft Visual Studio 12.0\VC\include\ratio 121 1 game Error 44 error C2039: '_abs64' : is not a member of '`global namespace'' C:\Program Files (x86)\Microsoft Visual Studio 12.0\VC\include\cinttypes 22 1 scripts Error 45 error C2873: '_abs64' : symbol cannot be used in a using-declaration C:\Program Files (x86)\Microsoft Visual Studio 12.0\VC\include\cinttypes 22 1 scripts Error 46 error C2039: '_strtoi64' : is not a member of '`global namespace'' C:\Program Files (x86)\Microsoft Visual Studio 12.0\VC\include\cinttypes 23 1 scripts Error 47 error C2873: '_strtoi64' : symbol cannot be used in a using-declaration C:\Program Files (x86)\Microsoft Visual Studio 12.0\VC\include\cinttypes 23 1 scripts Error 48 error C2039: '_strtoui64' : is not a member of '`global namespace'' C:\Program Files (x86)\Microsoft Visual Studio 12.0\VC\include\cinttypes 23 1 scripts Error 49 error C2873: '_strtoui64' : symbol cannot be used in a using-declaration C:\Program Files (x86)\Microsoft Visual Studio 12.0\VC\include\cinttypes 23 1 scripts Error 50 error C2065: 'INTMAX_MAX' : undeclared identifier C:\Program Files (x86)\Microsoft Visual Studio 12.0\VC\include\ratio 122 1 scripts Error 51 error C2065: 'INTMAX_MAX' : undeclared identifier C:\Program Files (x86)\Microsoft Visual Studio 12.0\VC\include\ratio 124 1 scripts Error 52 error C2065: 'INTMAX_MAX' : undeclared identifier C:\Program Files (x86)\Microsoft Visual Studio 12.0\VC\include\ratio 44 1 scripts Error 53 error C2338: integer arithmetic overflow C:\Program Files (x86)\Microsoft Visual Studio 12.0\VC\include\ratio 36 1 scripts Error 54 error C2039: 'value' : is not a member of 'std::_Safe_multX<0x01,0x01,false>' C:\Program Files (x86)\Microsoft Visual Studio 12.0\VC\include\ratio 44 1 scripts Error 55 error C2065: 'value' : undeclared identifier C:\Program Files (x86)\Microsoft Visual Studio 12.0\VC\include\ratio 44 1 scripts Error 56 error C2057: expected constant expression C:\Program Files (x86)\Microsoft Visual Studio 12.0\VC\include\ratio 44 1 scripts Error 57 error C2039: 'value' : is not a member of 'std::_Safe_multX<0x01,0x0989680,false>' C:\Program Files (x86)\Microsoft Visual Studio 12.0\VC\include\ratio 44 1 scripts Error 58 error C2975: '_Nx' : invalid template argument for 'std::ratio', expected compile-time constant expression C:\Program Files (x86)\Microsoft Visual Studio 12.0\VC\include\ratio 219 1 scripts Error 59 error C2975: '_Dx' : invalid template argument for 'std::ratio', expected compile-time constant expression C:\Program Files (x86)\Microsoft Visual Studio 12.0\VC\include\ratio 219 1 scripts Error 60 error C2065: 'INTMAX_MAX' : undeclared identifier (C:\Users\Kenny\Desktop\1\src\server\shared\Cryptography\OpenSSLCrypto.cpp) C:\Program Files (x86)\Microsoft Visual Studio 12.0\VC\include\ratio 122 1 shared Error 61 error C2065: 'INTMAX_MAX' : undeclared identifier (C:\Users\Kenny\Desktop\1\src\server\shared\Cryptography\OpenSSLCrypto.cpp) C:\Program Files (x86)\Microsoft Visual Studio 12.0\VC\include\ratio 124 1 shared Error 62 error C2065: 'INTMAX_MAX' : undeclared identifier (C:\Users\Kenny\Desktop\1\src\server\shared\Cryptography\OpenSSLCrypto.cpp) C:\Program Files (x86)\Microsoft Visual Studio 12.0\VC\include\ratio 44 1 shared Error 63 error C2338: integer arithmetic overflow (C:\Users\Kenny\Desktop\1\src\server\shared\Cryptography\OpenSSLCrypto.cpp) C:\Program Files (x86)\Microsoft Visual Studio 12.0\VC\include\ratio 36 1 shared Error 64 error C2039: 'value' : is not a member of 'std::_Safe_multX<0x01,0x01,false>' (C:\Users\Kenny\Desktop\1\src\server\shared\Cryptography\OpenSSLCrypto.cpp) C:\Program Files (x86)\Microsoft Visual Studio 12.0\VC\include\ratio 44 1 shared Error 65 error C2065: 'value' : undeclared identifier (C:\Users\Kenny\Desktop\1\src\server\shared\Cryptography\OpenSSLCrypto.cpp) C:\Program Files (x86)\Microsoft Visual Studio 12.0\VC\include\ratio 44 1 shared Error 66 error C2057: expected constant expression (C:\Users\Kenny\Desktop\1\src\server\shared\Cryptography\OpenSSLCrypto.cpp) C:\Program Files (x86)\Microsoft Visual Studio 12.0\VC\include\ratio 44 1 shared Error 67 error C2039: 'value' : is not a member of 'std::_Safe_multX<0x01,0x0989680,false>' (C:\Users\Kenny\Desktop\1\src\server\shared\Cryptography\OpenSSLCrypto.cpp) C:\Program Files (x86)\Microsoft Visual Studio 12.0\VC\include\ratio 44 1 shared Error 68 error C2975: '_Nx' : invalid template argument for 'std::ratio', expected compile-time constant expression (C:\Users\Kenny\Desktop\1\src\server\shared\Cryptography\OpenSSLCrypto.cpp) C:\Program Files (x86)\Microsoft Visual Studio 12.0\VC\include\ratio 219 1 shared Error 69 error C2975: '_Dx' : invalid template argument for 'std::ratio', expected compile-time constant expression (C:\Users\Kenny\Desktop\1\src\server\shared\Cryptography\OpenSSLCrypto.cpp) C:\Program Files (x86)\Microsoft Visual Studio 12.0\VC\include\ratio 219 1 shared Error 70 error C2065: 'INTMAX_MAX' : undeclared identifier (C:\Users\Kenny\Desktop\1\src\server\shared\Service\ServiceWin32.cpp) C:\Program Files (x86)\Microsoft Visual Studio 12.0\VC\include\ratio 122 1 shared Error 71 error C2065: 'INTMAX_MAX' : undeclared identifier (C:\Users\Kenny\Desktop\1\src\server\shared\Service\ServiceWin32.cpp) C:\Program Files (x86)\Microsoft Visual Studio 12.0\VC\include\ratio 124 1 shared Error 72 error C2065: 'INTMAX_MAX' : undeclared identifier (C:\Users\Kenny\Desktop\1\src\server\shared\Service\ServiceWin32.cpp) C:\Program Files (x86)\Microsoft Visual Studio 12.0\VC\include\ratio 44 1 shared Error 73 error C2338: integer arithmetic overflow (C:\Users\Kenny\Desktop\1\src\server\shared\Service\ServiceWin32.cpp) C:\Program Files (x86)\Microsoft Visual Studio 12.0\VC\include\ratio 36 1 shared Error 74 error C2039: 'value' : is not a member of 'std::_Safe_multX<0x01,0x01,false>' (C:\Users\Kenny\Desktop\1\src\server\shared\Service\ServiceWin32.cpp) C:\Program Files (x86)\Microsoft Visual Studio 12.0\VC\include\ratio 44 1 shared Error 75 error C2065: 'value' : undeclared identifier (C:\Users\Kenny\Desktop\1\src\server\shared\Service\ServiceWin32.cpp) C:\Program Files (x86)\Microsoft Visual Studio 12.0\VC\include\ratio 44 1 shared Error 76 error C2057: expected constant expression (C:\Users\Kenny\Desktop\1\src\server\shared\Service\ServiceWin32.cpp) C:\Program Files (x86)\Microsoft Visual Studio 12.0\VC\include\ratio 44 1 shared Error 77 error C2039: 'value' : is not a member of 'std::_Safe_multX<0x01,0x0989680,false>' (C:\Users\Kenny\Desktop\1\src\server\shared\Service\ServiceWin32.cpp) C:\Program Files (x86)\Microsoft Visual Studio 12.0\VC\include\ratio 44 1 shared Error 78 error C2975: '_Nx' : invalid template argument for 'std::ratio', expected compile-time constant expression (C:\Users\Kenny\Desktop\1\src\server\shared\Service\ServiceWin32.cpp) C:\Program Files (x86)\Microsoft Visual Studio 12.0\VC\include\ratio 219 1 shared Error 79 error C2975: '_Dx' : invalid template argument for 'std::ratio', expected compile-time constant expression (C:\Users\Kenny\Desktop\1\src\server\shared\Service\ServiceWin32.cpp) C:\Program Files (x86)\Microsoft Visual Studio 12.0\VC\include\ratio 219 1 shared Error 80 error C2065: 'INTMAX_MAX' : undeclared identifier (C:\Users\Kenny\Desktop\1\src\server\shared\Packets\ByteBuffer.cpp) C:\Program Files (x86)\Microsoft Visual Studio 12.0\VC\include\ratio 122 1 shared Error 81 error C2065: 'INTMAX_MAX' : undeclared identifier (C:\Users\Kenny\Desktop\1\src\server\shared\Packets\ByteBuffer.cpp) C:\Program Files (x86)\Microsoft Visual Studio 12.0\VC\include\ratio 124 1 shared Error 82 error C2065: 'INTMAX_MAX' : undeclared identifier (C:\Users\Kenny\Desktop\1\src\server\shared\Packets\ByteBuffer.cpp) C:\Program Files (x86)\Microsoft Visual Studio 12.0\VC\include\ratio 44 1 shared Error 83 error C2338: integer arithmetic overflow (C:\Users\Kenny\Desktop\1\src\server\shared\Packets\ByteBuffer.cpp) C:\Program Files (x86)\Microsoft Visual Studio 12.0\VC\include\ratio 36 1 shared Error 84 error C2039: 'value' : is not a member of 'std::_Safe_multX<0x01,0x01,false>' (C:\Users\Kenny\Desktop\1\src\server\shared\Packets\ByteBuffer.cpp) C:\Program Files (x86)\Microsoft Visual Studio 12.0\VC\include\ratio 44 1 shared Error 85 error C2065: 'value' : undeclared identifier (C:\Users\Kenny\Desktop\1\src\server\shared\Packets\ByteBuffer.cpp) C:\Program Files (x86)\Microsoft Visual Studio 12.0\VC\include\ratio 44 1 shared Error 86 error C2057: expected constant expression (C:\Users\Kenny\Desktop\1\src\server\shared\Packets\ByteBuffer.cpp) C:\Program Files (x86)\Microsoft Visual Studio 12.0\VC\include\ratio 44 1 shared Error 87 error C2039: 'value' : is not a member of 'std::_Safe_multX<0x01,0x0989680,false>' (C:\Users\Kenny\Desktop\1\src\server\shared\Packets\ByteBuffer.cpp) C:\Program Files (x86)\Microsoft Visual Studio 12.0\VC\include\ratio 44 1 shared Error 88 error C2975: '_Nx' : invalid template argument for 'std::ratio', expected compile-time constant expression (C:\Users\Kenny\Desktop\1\src\server\shared\Packets\ByteBuffer.cpp) C:\Program Files (x86)\Microsoft Visual Studio 12.0\VC\include\ratio 219 1 shared Error 89 error C2975: '_Dx' : invalid template argument for 'std::ratio', expected compile-time constant expression (C:\Users\Kenny\Desktop\1\src\server\shared\Packets\ByteBuffer.cpp) C:\Program Files (x86)\Microsoft Visual Studio 12.0\VC\include\ratio 219 1 shared Error 90 error C2065: 'INTMAX_MAX' : undeclared identifier (C:\Users\Kenny\Desktop\1\src\server\shared\Cryptography\HMACSHA1.cpp) C:\Program Files (x86)\Microsoft Visual Studio 12.0\VC\include\ratio 122 1 shared Error 91 error C2065: 'INTMAX_MAX' : undeclared identifier (C:\Users\Kenny\Desktop\1\src\server\shared\Cryptography\HMACSHA1.cpp) C:\Program Files (x86)\Microsoft Visual Studio 12.0\VC\include\ratio 124 1 shared Error 92 error C2065: 'INTMAX_MAX' : undeclared identifier (C:\Users\Kenny\Desktop\1\src\server\shared\Cryptography\HMACSHA1.cpp) C:\Program Files (x86)\Microsoft Visual Studio 12.0\VC\include\ratio 44 1 shared Error 93 error C2338: integer arithmetic overflow (C:\Users\Kenny\Desktop\1\src\server\shared\Cryptography\HMACSHA1.cpp) C:\Program Files (x86)\Microsoft Visual Studio 12.0\VC\include\ratio 36 1 shared Error 94 error C2039: 'value' : is not a member of 'std::_Safe_multX<0x01,0x01,false>' (C:\Users\Kenny\Desktop\1\src\server\shared\Cryptography\HMACSHA1.cpp) C:\Program Files (x86)\Microsoft Visual Studio 12.0\VC\include\ratio 44 1 shared Error 95 error C2065: 'value' : undeclared identifier (C:\Users\Kenny\Desktop\1\src\server\shared\Cryptography\HMACSHA1.cpp) C:\Program Files (x86)\Microsoft Visual Studio 12.0\VC\include\ratio 44 1 shared Error 96 error C2057: expected constant expression (C:\Users\Kenny\Desktop\1\src\server\shared\Cryptography\HMACSHA1.cpp) C:\Program Files (x86)\Microsoft Visual Studio 12.0\VC\include\ratio 44 1 shared Error 97 error C2039: 'value' : is not a member of 'std::_Safe_multX<0x01,0x0989680,false>' (C:\Users\Kenny\Desktop\1\src\server\shared\Cryptography\HMACSHA1.cpp) C:\Program Files (x86)\Microsoft Visual Studio 12.0\VC\include\ratio 44 1 shared Error 98 error C2975: '_Nx' : invalid template argument for 'std::ratio', expected compile-time constant expression (C:\Users\Kenny\Desktop\1\src\server\shared\Cryptography\HMACSHA1.cpp) C:\Program Files (x86)\Microsoft Visual Studio 12.0\VC\include\ratio 219 1 shared Error 99 error C2975: '_Dx' : invalid template argument for 'std::ratio', expected compile-time constant expression (C:\Users\Kenny\Desktop\1\src\server\shared\Cryptography\HMACSHA1.cpp) C:\Program Files (x86)\Microsoft Visual Studio 12.0\VC\include\ratio 219 1 shared Error 100 error C2065: 'INTMAX_MAX' : undeclared identifier (C:\Users\Kenny\Desktop\1\src\tools\mmaps_generator\TerrainBuilder.cpp) C:\Program Files (x86)\Microsoft Visual Studio 12.0\VC\include\ratio 122 1 mmaps_generator Error 101 error C2065: 'INTMAX_MAX' : undeclared identifier (C:\Users\Kenny\Desktop\1\src\tools\mmaps_generator\TerrainBuilder.cpp) C:\Program Files (x86)\Microsoft Visual Studio 12.0\VC\include\ratio 124 1 mmaps_generator Error 102 error C2065: 'INTMAX_MAX' : undeclared identifier (C:\Users\Kenny\Desktop\1\src\tools\mmaps_generator\TerrainBuilder.cpp) C:\Program Files (x86)\Microsoft Visual Studio 12.0\VC\include\ratio 44 1 mmaps_generator Error 103 error C2338: integer arithmetic overflow (C:\Users\Kenny\Desktop\1\src\tools\mmaps_generator\TerrainBuilder.cpp) C:\Program Files (x86)\Microsoft Visual Studio 12.0\VC\include\ratio 36 1 mmaps_generator Error 104 error C2039: 'value' : is not a member of 'std::_Safe_multX<0x01,0x01,false>' (C:\Users\Kenny\Desktop\1\src\tools\mmaps_generator\TerrainBuilder.cpp) C:\Program Files (x86)\Microsoft Visual Studio 12.0\VC\include\ratio 44 1 mmaps_generator Error 105 error C2065: 'value' : undeclared identifier (C:\Users\Kenny\Desktop\1\src\tools\mmaps_generator\TerrainBuilder.cpp) C:\Program Files (x86)\Microsoft Visual Studio 12.0\VC\include\ratio 44 1 mmaps_generator Error 106 error C2057: expected constant expression (C:\Users\Kenny\Desktop\1\src\tools\mmaps_generator\TerrainBuilder.cpp) C:\Program Files (x86)\Microsoft Visual Studio 12.0\VC\include\ratio 44 1 mmaps_generator Error 107 error C2039: 'value' : is not a member of 'std::_Safe_multX<0x01,0x0989680,false>' (C:\Users\Kenny\Desktop\1\src\tools\mmaps_generator\TerrainBuilder.cpp) C:\Program Files (x86)\Microsoft Visual Studio 12.0\VC\include\ratio 44 1 mmaps_generator Error 108 error C2975: '_Nx' : invalid template argument for 'std::ratio', expected compile-time constant expression (C:\Users\Kenny\Desktop\1\src\tools\mmaps_generator\TerrainBuilder.cpp) C:\Program Files (x86)\Microsoft Visual Studio 12.0\VC\include\ratio 219 1 mmaps_generator Error 109 error C2975: '_Dx' : invalid template argument for 'std::ratio', expected compile-time constant expression (C:\Users\Kenny\Desktop\1\src\tools\mmaps_generator\TerrainBuilder.cpp) C:\Program Files (x86)\Microsoft Visual Studio 12.0\VC\include\ratio 219 1 mmaps_generator Error 110 error C2065: 'INTMAX_MAX' : undeclared identifier (C:\Users\Kenny\Desktop\1\src\tools\mmaps_generator\MapBuilder.cpp) C:\Program Files (x86)\Microsoft Visual Studio 12.0\VC\include\ratio 122 1 mmaps_generator Error 111 error C2065: 'INTMAX_MAX' : undeclared identifier (C:\Users\Kenny\Desktop\1\src\tools\mmaps_generator\MapBuilder.cpp) C:\Program Files (x86)\Microsoft Visual Studio 12.0\VC\include\ratio 124 1 mmaps_generator Error 112 error C2065: 'INTMAX_MAX' : undeclared identifier (C:\Users\Kenny\Desktop\1\src\tools\mmaps_generator\PathGenerator.cpp) C:\Program Files (x86)\Microsoft Visual Studio 12.0\VC\include\ratio 122 1 mmaps_generator Error 113 error C2065: 'INTMAX_MAX' : undeclared identifier (C:\Users\Kenny\Desktop\1\src\tools\mmaps_generator\PathGenerator.cpp) C:\Program Files (x86)\Microsoft Visual Studio 12.0\VC\include\ratio 124 1 mmaps_generator Error 114 error C2065: 'INTMAX_MAX' : undeclared identifier (C:\Users\Kenny\Desktop\1\src\tools\mmaps_generator\MapBuilder.cpp) C:\Program Files (x86)\Microsoft Visual Studio 12.0\VC\include\ratio 44 1 mmaps_generator Error 115 error C2338: integer arithmetic overflow (C:\Users\Kenny\Desktop\1\src\tools\mmaps_generator\MapBuilder.cpp) C:\Program Files (x86)\Microsoft Visual Studio 12.0\VC\include\ratio 36 1 mmaps_generator Error 116 error C2039: 'value' : is not a member of 'std::_Safe_multX<0x01,0x01,false>' (C:\Users\Kenny\Desktop\1\src\tools\mmaps_generator\MapBuilder.cpp) C:\Program Files (x86)\Microsoft Visual Studio 12.0\VC\include\ratio 44 1 mmaps_generator Error 117 error C2065: 'value' : undeclared identifier (C:\Users\Kenny\Desktop\1\src\tools\mmaps_generator\MapBuilder.cpp) C:\Program Files (x86)\Microsoft Visual Studio 12.0\VC\include\ratio 44 1 mmaps_generator Error 118 error C2057: expected constant expression (C:\Users\Kenny\Desktop\1\src\tools\mmaps_generator\MapBuilder.cpp) C:\Program Files (x86)\Microsoft Visual Studio 12.0\VC\include\ratio 44 1 mmaps_generator Error 119 error C2039: 'value' : is not a member of 'std::_Safe_multX<0x01,0x0989680,false>' (C:\Users\Kenny\Desktop\1\src\tools\mmaps_generator\MapBuilder.cpp) C:\Program Files (x86)\Microsoft Visual Studio 12.0\VC\include\ratio 44 1 mmaps_generator Error 120 error C2975: '_Nx' : invalid template argument for 'std::ratio', expected compile-time constant expression (C:\Users\Kenny\Desktop\1\src\tools\mmaps_generator\MapBuilder.cpp) C:\Program Files (x86)\Microsoft Visual Studio 12.0\VC\include\ratio 219 1 mmaps_generator Error 121 error C2975: '_Dx' : invalid template argument for 'std::ratio', expected compile-time constant expression (C:\Users\Kenny\Desktop\1\src\tools\mmaps_generator\MapBuilder.cpp) C:\Program Files (x86)\Microsoft Visual Studio 12.0\VC\include\ratio 219 1 mmaps_generator Error 122 error C2065: 'INTMAX_MAX' : undeclared identifier (C:\Users\Kenny\Desktop\1\src\tools\mmaps_generator\IntermediateValues.cpp) C:\Program Files (x86)\Microsoft Visual Studio 12.0\VC\include\ratio 122 1 mmaps_generator Error 123 error C2065: 'INTMAX_MAX' : undeclared identifier (C:\Users\Kenny\Desktop\1\src\tools\mmaps_generator\IntermediateValues.cpp) C:\Program Files (x86)\Microsoft Visual Studio 12.0\VC\include\ratio 124 1 mmaps_generator Error 124 error C2065: 'INTMAX_MAX' : undeclared identifier (C:\Users\Kenny\Desktop\1\src\tools\mmaps_generator\PathGenerator.cpp) C:\Program Files (x86)\Microsoft Visual Studio 12.0\VC\include\ratio 44 1 mmaps_generator Error 125 error C2338: integer arithmetic overflow (C:\Users\Kenny\Desktop\1\src\tools\mmaps_generator\PathGenerator.cpp) C:\Program Files (x86)\Microsoft Visual Studio 12.0\VC\include\ratio 36 1 mmaps_generator Error 126 error C2039: 'value' : is not a member of 'std::_Safe_multX<0x01,0x01,false>' (C:\Users\Kenny\Desktop\1\src\tools\mmaps_generator\PathGenerator.cpp) C:\Program Files (x86)\Microsoft Visual Studio 12.0\VC\include\ratio 44 1 mmaps_generator Error 127 error C2065: 'value' : undeclared identifier (C:\Users\Kenny\Desktop\1\src\tools\mmaps_generator\PathGenerator.cpp) C:\Program Files (x86)\Microsoft Visual Studio 12.0\VC\include\ratio 44 1 mmaps_generator Error 128 error C2057: expected constant expression (C:\Users\Kenny\Desktop\1\src\tools\mmaps_generator\PathGenerator.cpp) C:\Program Files (x86)\Microsoft Visual Studio 12.0\VC\include\ratio 44 1 mmaps_generator Error 129 error C2039: 'value' : is not a member of 'std::_Safe_multX<0x01,0x0989680,false>' (C:\Users\Kenny\Desktop\1\src\tools\mmaps_generator\PathGenerator.cpp) C:\Program Files (x86)\Microsoft Visual Studio 12.0\VC\include\ratio 44 1 mmaps_generator Error 130 error C2975: '_Nx' : invalid template argument for 'std::ratio', expected compile-time constant expression (C:\Users\Kenny\Desktop\1\src\tools\mmaps_generator\PathGenerator.cpp) C:\Program Files (x86)\Microsoft Visual Studio 12.0\VC\include\ratio 219 1 mmaps_generator Error 131 error C2975: '_Dx' : invalid template argument for 'std::ratio', expected compile-time constant expression (C:\Users\Kenny\Desktop\1\src\tools\mmaps_generator\PathGenerator.cpp) C:\Program Files (x86)\Microsoft Visual Studio 12.0\VC\include\ratio 219 1 mmaps_generator Error 132 error C2065: 'INTMAX_MAX' : undeclared identifier (C:\Users\Kenny\Desktop\1\src\tools\mmaps_generator\IntermediateValues.cpp) C:\Program Files (x86)\Microsoft Visual Studio 12.0\VC\include\ratio 44 1 mmaps_generator Error 133 error C2338: integer arithmetic overflow (C:\Users\Kenny\Desktop\1\src\tools\mmaps_generator\IntermediateValues.cpp) C:\Program Files (x86)\Microsoft Visual Studio 12.0\VC\include\ratio 36 1 mmaps_generator Error 134 error C2039: 'value' : is not a member of 'std::_Safe_multX<0x01,0x01,false>' (C:\Users\Kenny\Desktop\1\src\tools\mmaps_generator\IntermediateValues.cpp) C:\Program Files (x86)\Microsoft Visual Studio 12.0\VC\include\ratio 44 1 mmaps_generator Error 135 error C2065: 'value' : undeclared identifier (C:\Users\Kenny\Desktop\1\src\tools\mmaps_generator\IntermediateValues.cpp) C:\Program Files (x86)\Microsoft Visual Studio 12.0\VC\include\ratio 44 1 mmaps_generator Error 136 error C2057: expected constant expression (C:\Users\Kenny\Desktop\1\src\tools\mmaps_generator\IntermediateValues.cpp) C:\Program Files (x86)\Microsoft Visual Studio 12.0\VC\include\ratio 44 1 mmaps_generator Error 137 error C2039: 'value' : is not a member of 'std::_Safe_multX<0x01,0x0989680,false>' (C:\Users\Kenny\Desktop\1\src\tools\mmaps_generator\IntermediateValues.cpp) C:\Program Files (x86)\Microsoft Visual Studio 12.0\VC\include\ratio 44 1 mmaps_generator Error 138 error C2975: '_Nx' : invalid template argument for 'std::ratio', expected compile-time constant expression (C:\Users\Kenny\Desktop\1\src\tools\mmaps_generator\IntermediateValues.cpp) C:\Program Files (x86)\Microsoft Visual Studio 12.0\VC\include\ratio 219 1 mmaps_generator Error 139 error C2975: '_Dx' : invalid template argument for 'std::ratio', expected compile-time constant expression (C:\Users\Kenny\Desktop\1\src\tools\mmaps_generator\IntermediateValues.cpp) C:\Program Files (x86)\Microsoft Visual Studio 12.0\VC\include\ratio 219 1 mmaps_generator Error 140 error C2338: zero denominator (C:\Users\Kenny\Desktop\1\src\tools\mmaps_generator\PathGenerator.cpp) C:\Program Files (x86)\Microsoft Visual Studio 12.0\VC\include\ratio 121 1 mmaps_generator Error 141 error C2065: 'INTMAX_MAX' : undeclared identifier (C:\Users\Kenny\Desktop\1\src\tools\mmaps_generator\VMapExtensions.cpp) C:\Program Files (x86)\Microsoft Visual Studio 12.0\VC\include\ratio 122 1 mmaps_generator Error 142 error C2065: 'INTMAX_MAX' : undeclared identifier (C:\Users\Kenny\Desktop\1\src\tools\mmaps_generator\VMapExtensions.cpp) C:\Program Files (x86)\Microsoft Visual Studio 12.0\VC\include\ratio 124 1 mmaps_generator Error 143 error C2065: 'INTMAX_MAX' : undeclared identifier (C:\Users\Kenny\Desktop\1\src\tools\mmaps_generator\VMapExtensions.cpp) C:\Program Files (x86)\Microsoft Visual Studio 12.0\VC\include\ratio 44 1 mmaps_generator Error 144 error C2338: integer arithmetic overflow (C:\Users\Kenny\Desktop\1\src\tools\mmaps_generator\VMapExtensions.cpp) C:\Program Files (x86)\Microsoft Visual Studio 12.0\VC\include\ratio 36 1 mmaps_generator Error 145 error C2039: 'value' : is not a member of 'std::_Safe_multX<0x01,0x01,false>' (C:\Users\Kenny\Desktop\1\src\tools\mmaps_generator\VMapExtensions.cpp) C:\Program Files (x86)\Microsoft Visual Studio 12.0\VC\include\ratio 44 1 mmaps_generator Error 146 error C2065: 'value' : undeclared identifier (C:\Users\Kenny\Desktop\1\src\tools\mmaps_generator\VMapExtensions.cpp) C:\Program Files (x86)\Microsoft Visual Studio 12.0\VC\include\ratio 44 1 mmaps_generator Error 147 error C2057: expected constant expression (C:\Users\Kenny\Desktop\1\src\tools\mmaps_generator\VMapExtensions.cpp) C:\Program Files (x86)\Microsoft Visual Studio 12.0\VC\include\ratio 44 1 mmaps_generator Error 148 error C2039: 'value' : is not a member of 'std::_Safe_multX<0x01,0x0989680,false>' (C:\Users\Kenny\Desktop\1\src\tools\mmaps_generator\VMapExtensions.cpp) C:\Program Files (x86)\Microsoft Visual Studio 12.0\VC\include\ratio 44 1 mmaps_generator Error 149 error C2975: '_Nx' : invalid template argument for 'std::ratio', expected compile-time constant expression (C:\Users\Kenny\Desktop\1\src\tools\mmaps_generator\VMapExtensions.cpp) C:\Program Files (x86)\Microsoft Visual Studio 12.0\VC\include\ratio 219 1 mmaps_generator Error 150 error C2975: '_Dx' : invalid template argument for 'std::ratio', expected compile-time constant expression (C:\Users\Kenny\Desktop\1\src\tools\mmaps_generator\VMapExtensions.cpp) C:\Program Files (x86)\Microsoft Visual Studio 12.0\VC\include\ratio 219 1 mmaps_generator Error 151 error LNK1181: cannot open input file '..\..\common\Release\common.lib' C:\Users\Kenny\Desktop\2, 2013\src\tools\vmap4_assembler\LINK vmap4assembler Error 152 error C2338: zero denominator C:\Program Files (x86)\Microsoft Visual Studio 12.0\VC\include\ratio 121 1 scripts Error 153 error C2039: '_abs64' : is not a member of '`global namespace'' (C:\Users\Kenny\Desktop\1\src\LuaEngine\CreatureHooks.cpp) C:\Program Files (x86)\Microsoft Visual Studio 12.0\VC\include\cinttypes 22 1 LuaEngine Error 154 error C2039: '_abs64' : is not a member of '`global namespace'' (C:\Users\Kenny\Desktop\1\src\LuaEngine\BattleGroundHooks.cpp) C:\Program Files (x86)\Microsoft Visual Studio 12.0\VC\include\cinttypes 22 1 LuaEngine Error 155 error C2873: '_abs64' : symbol cannot be used in a using-declaration (C:\Users\Kenny\Desktop\1\src\LuaEngine\BattleGroundHooks.cpp) C:\Program Files (x86)\Microsoft Visual Studio 12.0\VC\include\cinttypes 22 1 LuaEngine Error 156 error C2039: '_strtoi64' : is not a member of '`global namespace'' (C:\Users\Kenny\Desktop\1\src\LuaEngine\BattleGroundHooks.cpp) C:\Program Files (x86)\Microsoft Visual Studio 12.0\VC\include\cinttypes 23 1 LuaEngine Error 157 error C2873: '_strtoi64' : symbol cannot be used in a using-declaration (C:\Users\Kenny\Desktop\1\src\LuaEngine\BattleGroundHooks.cpp) C:\Program Files (x86)\Microsoft Visual Studio 12.0\VC\include\cinttypes 23 1 LuaEngine Error 158 error C2039: '_strtoui64' : is not a member of '`global namespace'' (C:\Users\Kenny\Desktop\1\src\LuaEngine\BattleGroundHooks.cpp) C:\Program Files (x86)\Microsoft Visual Studio 12.0\VC\include\cinttypes 23 1 LuaEngine Error 159 error C2873: '_strtoui64' : symbol cannot be used in a using-declaration (C:\Users\Kenny\Desktop\1\src\LuaEngine\BattleGroundHooks.cpp) C:\Program Files (x86)\Microsoft Visual Studio 12.0\VC\include\cinttypes 23 1 LuaEngine Error 160 error C2873: '_abs64' : symbol cannot be used in a using-declaration (C:\Users\Kenny\Desktop\1\src\LuaEngine\CreatureHooks.cpp) C:\Program Files (x86)\Microsoft Visual Studio 12.0\VC\include\cinttypes 22 1 LuaEngine Error 161 error C2039: '_strtoi64' : is not a member of '`global namespace'' (C:\Users\Kenny\Desktop\1\src\LuaEngine\CreatureHooks.cpp) C:\Program Files (x86)\Microsoft Visual Studio 12.0\VC\include\cinttypes 23 1 LuaEngine Error 162 error C2873: '_strtoi64' : symbol cannot be used in a using-declaration (C:\Users\Kenny\Desktop\1\src\LuaEngine\CreatureHooks.cpp) C:\Program Files (x86)\Microsoft Visual Studio 12.0\VC\include\cinttypes 23 1 LuaEngine Error 163 error C2039: '_strtoui64' : is not a member of '`global namespace'' (C:\Users\Kenny\Desktop\1\src\LuaEngine\CreatureHooks.cpp) C:\Program Files (x86)\Microsoft Visual Studio 12.0\VC\include\cinttypes 23 1 LuaEngine Error 164 error C2873: '_strtoui64' : symbol cannot be used in a using-declaration (C:\Users\Kenny\Desktop\1\src\LuaEngine\CreatureHooks.cpp) C:\Program Files (x86)\Microsoft Visual Studio 12.0\VC\include\cinttypes 23 1 LuaEngine Error 165 error C2039: '_abs64' : is not a member of '`global namespace'' (C:\Users\Kenny\Desktop\1\src\LuaEngine\ElunaInstanceAI.cpp) C:\Program Files (x86)\Microsoft Visual Studio 12.0\VC\include\cinttypes 22 1 LuaEngine Error 166 error C2873: '_abs64' : symbol cannot be used in a using-declaration (C:\Users\Kenny\Desktop\1\src\LuaEngine\ElunaInstanceAI.cpp) C:\Program Files (x86)\Microsoft Visual Studio 12.0\VC\include\cinttypes 22 1 LuaEngine Error 167 error C2039: '_strtoi64' : is not a member of '`global namespace'' (C:\Users\Kenny\Desktop\1\src\LuaEngine\ElunaInstanceAI.cpp) C:\Program Files (x86)\Microsoft Visual Studio 12.0\VC\include\cinttypes 23 1 LuaEngine Error 168 error C2873: '_strtoi64' : symbol cannot be used in a using-declaration (C:\Users\Kenny\Desktop\1\src\LuaEngine\ElunaInstanceAI.cpp) C:\Program Files (x86)\Microsoft Visual Studio 12.0\VC\include\cinttypes 23 1 LuaEngine Error 169 error C2039: '_strtoui64' : is not a member of '`global namespace'' (C:\Users\Kenny\Desktop\1\src\LuaEngine\ElunaInstanceAI.cpp) C:\Program Files (x86)\Microsoft Visual Studio 12.0\VC\include\cinttypes 23 1 LuaEngine Error 170 error C2873: '_strtoui64' : symbol cannot be used in a using-declaration (C:\Users\Kenny\Desktop\1\src\LuaEngine\ElunaInstanceAI.cpp) C:\Program Files (x86)\Microsoft Visual Studio 12.0\VC\include\cinttypes 23 1 LuaEngine Error 171 error C2065: 'INTMAX_MAX' : undeclared identifier (C:\Users\Kenny\Desktop\1\src\LuaEngine\BattleGroundHooks.cpp) C:\Program Files (x86)\Microsoft Visual Studio 12.0\VC\include\ratio 122 1 LuaEngine Error 172 error C2065: 'INTMAX_MAX' : undeclared identifier (C:\Users\Kenny\Desktop\1\src\LuaEngine\BattleGroundHooks.cpp) C:\Program Files (x86)\Microsoft Visual Studio 12.0\VC\include\ratio 124 1 LuaEngine Error 173 error C2065: 'INTMAX_MAX' : undeclared identifier (C:\Users\Kenny\Desktop\1\src\LuaEngine\BattleGroundHooks.cpp) C:\Program Files (x86)\Microsoft Visual Studio 12.0\VC\include\ratio 44 1 LuaEngine Error 174 error C2338: integer arithmetic overflow (C:\Users\Kenny\Desktop\1\src\LuaEngine\BattleGroundHooks.cpp) C:\Program Files (x86)\Microsoft Visual Studio 12.0\VC\include\ratio 36 1 LuaEngine Error 175 error C2039: 'value' : is not a member of 'std::_Safe_multX<0x01,0x01,false>' (C:\Users\Kenny\Desktop\1\src\LuaEngine\BattleGroundHooks.cpp) C:\Program Files (x86)\Microsoft Visual Studio 12.0\VC\include\ratio 44 1 LuaEngine Error 176 error C2065: 'value' : undeclared identifier (C:\Users\Kenny\Desktop\1\src\LuaEngine\BattleGroundHooks.cpp) C:\Program Files (x86)\Microsoft Visual Studio 12.0\VC\include\ratio 44 1 LuaEngine Error 177 error C2057: expected constant expression (C:\Users\Kenny\Desktop\1\src\LuaEngine\BattleGroundHooks.cpp) C:\Program Files (x86)\Microsoft Visual Studio 12.0\VC\include\ratio 44 1 LuaEngine Error 178 error C2039: 'value' : is not a member of 'std::_Safe_multX<0x01,0x0989680,false>' (C:\Users\Kenny\Desktop\1\src\LuaEngine\BattleGroundHooks.cpp) C:\Program Files (x86)\Microsoft Visual Studio 12.0\VC\include\ratio 44 1 LuaEngine Error 179 error C2975: '_Nx' : invalid template argument for 'std::ratio', expected compile-time constant expression (C:\Users\Kenny\Desktop\1\src\LuaEngine\BattleGroundHooks.cpp) C:\Program Files (x86)\Microsoft Visual Studio 12.0\VC\include\ratio 219 1 LuaEngine Error 180 error C2975: '_Dx' : invalid template argument for 'std::ratio', expected compile-time constant expression (C:\Users\Kenny\Desktop\1\src\LuaEngine\BattleGroundHooks.cpp) C:\Program Files (x86)\Microsoft Visual Studio 12.0\VC\include\ratio 219 1 LuaEngine Error 181 error C2065: 'INTMAX_MAX' : undeclared identifier (C:\Users\Kenny\Desktop\1\src\LuaEngine\CreatureHooks.cpp) C:\Program Files (x86)\Microsoft Visual Studio 12.0\VC\include\ratio 122 1 LuaEngine Error 182 error C2065: 'INTMAX_MAX' : undeclared identifier (C:\Users\Kenny\Desktop\1\src\LuaEngine\CreatureHooks.cpp) C:\Program Files (x86)\Microsoft Visual Studio 12.0\VC\include\ratio 124 1 LuaEngine Error 183 error C2065: 'INTMAX_MAX' : undeclared identifier (C:\Users\Kenny\Desktop\1\src\LuaEngine\CreatureHooks.cpp) C:\Program Files (x86)\Microsoft Visual Studio 12.0\VC\include\ratio 44 1 LuaEngine Error 184 error C2338: integer arithmetic overflow (C:\Users\Kenny\Desktop\1\src\LuaEngine\CreatureHooks.cpp) C:\Program Files (x86)\Microsoft Visual Studio 12.0\VC\include\ratio 36 1 LuaEngine Error 185 error C2039: 'value' : is not a member of 'std::_Safe_multX<0x01,0x01,false>' (C:\Users\Kenny\Desktop\1\src\LuaEngine\CreatureHooks.cpp) C:\Program Files (x86)\Microsoft Visual Studio 12.0\VC\include\ratio 44 1 LuaEngine Error 186 error C2065: 'value' : undeclared identifier (C:\Users\Kenny\Desktop\1\src\LuaEngine\CreatureHooks.cpp) C:\Program Files (x86)\Microsoft Visual Studio 12.0\VC\include\ratio 44 1 LuaEngine Error 187 error C2057: expected constant expression (C:\Users\Kenny\Desktop\1\src\LuaEngine\CreatureHooks.cpp) C:\Program Files (x86)\Microsoft Visual Studio 12.0\VC\include\ratio 44 1 LuaEngine Error 188 error C2039: 'value' : is not a member of 'std::_Safe_multX<0x01,0x0989680,false>' (C:\Users\Kenny\Desktop\1\src\LuaEngine\CreatureHooks.cpp) C:\Program Files (x86)\Microsoft Visual Studio 12.0\VC\include\ratio 44 1 LuaEngine Error 189 error C2975: '_Nx' : invalid template argument for 'std::ratio', expected compile-time constant expression (C:\Users\Kenny\Desktop\1\src\LuaEngine\CreatureHooks.cpp) C:\Program Files (x86)\Microsoft Visual Studio 12.0\VC\include\ratio 219 1 LuaEngine Error 190 error C2975: '_Dx' : invalid template argument for 'std::ratio', expected compile-time constant expression (C:\Users\Kenny\Desktop\1\src\LuaEngine\CreatureHooks.cpp) C:\Program Files (x86)\Microsoft Visual Studio 12.0\VC\include\ratio 219 1 LuaEngine Error 191 error C2065: 'INTMAX_MAX' : undeclared identifier (C:\Users\Kenny\Desktop\1\src\LuaEngine\ElunaInstanceAI.cpp) C:\Program Files (x86)\Microsoft Visual Studio 12.0\VC\include\ratio 122 1 LuaEngine Error 192 error C2065: 'INTMAX_MAX' : undeclared identifier (C:\Users\Kenny\Desktop\1\src\LuaEngine\ElunaInstanceAI.cpp) C:\Program Files (x86)\Microsoft Visual Studio 12.0\VC\include\ratio 124 1 LuaEngine Error 193 error C2065: 'INTMAX_MAX' : undeclared identifier (C:\Users\Kenny\Desktop\1\src\LuaEngine\ElunaInstanceAI.cpp) C:\Program Files (x86)\Microsoft Visual Studio 12.0\VC\include\ratio 44 1 LuaEngine Error 194 error C2338: integer arithmetic overflow (C:\Users\Kenny\Desktop\1\src\LuaEngine\ElunaInstanceAI.cpp) C:\Program Files (x86)\Microsoft Visual Studio 12.0\VC\include\ratio 36 1 LuaEngine Error 195 error C2039: 'value' : is not a member of 'std::_Safe_multX<0x01,0x01,false>' (C:\Users\Kenny\Desktop\1\src\LuaEngine\ElunaInstanceAI.cpp) C:\Program Files (x86)\Microsoft Visual Studio 12.0\VC\include\ratio 44 1 LuaEngine Error 196 error C2065: 'value' : undeclared identifier (C:\Users\Kenny\Desktop\1\src\LuaEngine\ElunaInstanceAI.cpp) C:\Program Files (x86)\Microsoft Visual Studio 12.0\VC\include\ratio 44 1 LuaEngine Error 197 error C2057: expected constant expression (C:\Users\Kenny\Desktop\1\src\LuaEngine\ElunaInstanceAI.cpp) C:\Program Files (x86)\Microsoft Visual Studio 12.0\VC\include\ratio 44 1 LuaEngine Error 198 error C2039: 'value' : is not a member of 'std::_Safe_multX<0x01,0x0989680,false>' (C:\Users\Kenny\Desktop\1\src\LuaEngine\ElunaInstanceAI.cpp) C:\Program Files (x86)\Microsoft Visual Studio 12.0\VC\include\ratio 44 1 LuaEngine Error 199 error C2975: '_Nx' : invalid template argument for 'std::ratio', expected compile-time constant expression (C:\Users\Kenny\Desktop\1\src\LuaEngine\ElunaInstanceAI.cpp) C:\Program Files (x86)\Microsoft Visual Studio 12.0\VC\include\ratio 219 1 LuaEngine Error 200 error C2975: '_Dx' : invalid template argument for 'std::ratio', expected compile-time constant expression (C:\Users\Kenny\Desktop\1\src\LuaEngine\ElunaInstanceAI.cpp) C:\Program Files (x86)\Microsoft Visual Studio 12.0\VC\include\ratio 219 1 LuaEngine Error 201 error C2065: 'INTMAX_MAX' : undeclared identifier (C:\Users\Kenny\Desktop\1\src\LuaEngine\ElunaEventMgr.cpp) C:\Program Files (x86)\Microsoft Visual Studio 12.0\VC\include\ratio 122 1 LuaEngine Error 202 error C2065: 'INTMAX_MAX' : undeclared identifier (C:\Users\Kenny\Desktop\1\src\LuaEngine\ElunaEventMgr.cpp) C:\Program Files (x86)\Microsoft Visual Studio 12.0\VC\include\ratio 124 1 LuaEngine Error 203 error C2065: 'INTMAX_MAX' : undeclared identifier (C:\Users\Kenny\Desktop\1\src\LuaEngine\ElunaEventMgr.cpp) C:\Program Files (x86)\Microsoft Visual Studio 12.0\VC\include\ratio 44 1 LuaEngine Error 204 error C2338: integer arithmetic overflow (C:\Users\Kenny\Desktop\1\src\LuaEngine\ElunaEventMgr.cpp) C:\Program Files (x86)\Microsoft Visual Studio 12.0\VC\include\ratio 36 1 LuaEngine Error 205 error C2039: 'value' : is not a member of 'std::_Safe_multX<0x01,0x01,false>' (C:\Users\Kenny\Desktop\1\src\LuaEngine\ElunaEventMgr.cpp) C:\Program Files (x86)\Microsoft Visual Studio 12.0\VC\include\ratio 44 1 LuaEngine Error 206 error C2065: 'value' : undeclared identifier (C:\Users\Kenny\Desktop\1\src\LuaEngine\ElunaEventMgr.cpp) C:\Program Files (x86)\Microsoft Visual Studio 12.0\VC\include\ratio 44 1 LuaEngine Error 207 error C2057: expected constant expression (C:\Users\Kenny\Desktop\1\src\LuaEngine\ElunaEventMgr.cpp) C:\Program Files (x86)\Microsoft Visual Studio 12.0\VC\include\ratio 44 1 LuaEngine Error 208 error C2039: 'value' : is not a member of 'std::_Safe_multX<0x01,0x0989680,false>' (C:\Users\Kenny\Desktop\1\src\LuaEngine\ElunaEventMgr.cpp) C:\Program Files (x86)\Microsoft Visual Studio 12.0\VC\include\ratio 44 1 LuaEngine Error 209 error C2975: '_Nx' : invalid template argument for 'std::ratio', expected compile-time constant expression (C:\Users\Kenny\Desktop\1\src\LuaEngine\ElunaEventMgr.cpp) C:\Program Files (x86)\Microsoft Visual Studio 12.0\VC\include\ratio 219 1 LuaEngine Error 210 error C2975: '_Dx' : invalid template argument for 'std::ratio', expected compile-time constant expression (C:\Users\Kenny\Desktop\1\src\LuaEngine\ElunaEventMgr.cpp) C:\Program Files (x86)\Microsoft Visual Studio 12.0\VC\include\ratio 219 1 LuaEngine Error 211 error C2338: zero denominator (C:\Users\Kenny\Desktop\1\src\LuaEngine\BattleGroundHooks.cpp) C:\Program Files (x86)\Microsoft Visual Studio 12.0\VC\include\ratio 121 1 LuaEngine Error 212 error C2338: zero denominator (C:\Users\Kenny\Desktop\1\src\LuaEngine\CreatureHooks.cpp) C:\Program Files (x86)\Microsoft Visual Studio 12.0\VC\include\ratio 121 1 LuaEngine Error 213 error C2338: zero denominator (C:\Users\Kenny\Desktop\1\src\LuaEngine\ElunaInstanceAI.cpp) C:\Program Files (x86)\Microsoft Visual Studio 12.0\VC\include\ratio 121 1 LuaEngine Error 214 error C2338: zero denominator (C:\Users\Kenny\Desktop\1\src\LuaEngine\ElunaEventMgr.cpp) C:\Program Files (x86)\Microsoft Visual Studio 12.0\VC\include\ratio 121 1 LuaEngine Error 215 error C2065: 'INTMAX_MAX' : undeclared identifier (C:\Users\Kenny\Desktop\1\src\LuaEngine\ElunaUtility.cpp) C:\Program Files (x86)\Microsoft Visual Studio 12.0\VC\include\ratio 122 1 LuaEngine Error 216 error C2065: 'INTMAX_MAX' : undeclared identifier (C:\Users\Kenny\Desktop\1\src\LuaEngine\ElunaUtility.cpp) C:\Program Files (x86)\Microsoft Visual Studio 12.0\VC\include\ratio 124 1 LuaEngine Error 217 error C2065: 'INTMAX_MAX' : undeclared identifier (C:\Users\Kenny\Desktop\1\src\LuaEngine\ElunaUtility.cpp) C:\Program Files (x86)\Microsoft Visual Studio 12.0\VC\include\ratio 44 1 LuaEngine Error 218 error C2338: integer arithmetic overflow (C:\Users\Kenny\Desktop\1\src\LuaEngine\ElunaUtility.cpp) C:\Program Files (x86)\Microsoft Visual Studio 12.0\VC\include\ratio 36 1 LuaEngine Error 219 error C2039: 'value' : is not a member of 'std::_Safe_multX<0x01,0x01,false>' (C:\Users\Kenny\Desktop\1\src\LuaEngine\ElunaUtility.cpp) C:\Program Files (x86)\Microsoft Visual Studio 12.0\VC\include\ratio 44 1 LuaEngine Error 220 error C2065: 'value' : undeclared identifier (C:\Users\Kenny\Desktop\1\src\LuaEngine\ElunaUtility.cpp) C:\Program Files (x86)\Microsoft Visual Studio 12.0\VC\include\ratio 44 1 LuaEngine Error 221 error C2057: expected constant expression (C:\Users\Kenny\Desktop\1\src\LuaEngine\ElunaUtility.cpp) C:\Program Files (x86)\Microsoft Visual Studio 12.0\VC\include\ratio 44 1 LuaEngine Error 222 error C2039: 'value' : is not a member of 'std::_Safe_multX<0x01,0x0989680,false>' (C:\Users\Kenny\Desktop\1\src\LuaEngine\ElunaUtility.cpp) C:\Program Files (x86)\Microsoft Visual Studio 12.0\VC\include\ratio 44 1 LuaEngine Error 223 error C2975: '_Nx' : invalid template argument for 'std::ratio', expected compile-time constant expression (C:\Users\Kenny\Desktop\1\src\LuaEngine\ElunaUtility.cpp) C:\Program Files (x86)\Microsoft Visual Studio 12.0\VC\include\ratio 219 1 LuaEngine Error 224 error C2975: '_Dx' : invalid template argument for 'std::ratio', expected compile-time constant expression (C:\Users\Kenny\Desktop\1\src\LuaEngine\ElunaUtility.cpp) C:\Program Files (x86)\Microsoft Visual Studio 12.0\VC\include\ratio 219 1 LuaEngine Error 225 error C2039: '_abs64' : is not a member of '`global namespace'' (C:\Users\Kenny\Desktop\1\src\LuaEngine\GameObjectHooks.cpp) C:\Program Files (x86)\Microsoft Visual Studio 12.0\VC\include\cinttypes 22 1 LuaEngine Error 226 error C2873: '_abs64' : symbol cannot be used in a using-declaration (C:\Users\Kenny\Desktop\1\src\LuaEngine\GameObjectHooks.cpp) C:\Program Files (x86)\Microsoft Visual Studio 12.0\VC\include\cinttypes 22 1 LuaEngine Error 227 error C2039: '_strtoi64' : is not a member of '`global namespace'' (C:\Users\Kenny\Desktop\1\src\LuaEngine\GameObjectHooks.cpp) C:\Program Files (x86)\Microsoft Visual Studio 12.0\VC\include\cinttypes 23 1 LuaEngine Error 228 error C2873: '_strtoi64' : symbol cannot be used in a using-declaration (C:\Users\Kenny\Desktop\1\src\LuaEngine\GameObjectHooks.cpp) C:\Program Files (x86)\Microsoft Visual Studio 12.0\VC\include\cinttypes 23 1 LuaEngine Error 229 error C2039: '_strtoui64' : is not a member of '`global namespace'' (C:\Users\Kenny\Desktop\1\src\LuaEngine\GameObjectHooks.cpp) C:\Program Files (x86)\Microsoft Visual Studio 12.0\VC\include\cinttypes 23 1 LuaEngine Error 230 error C2873: '_strtoui64' : symbol cannot be used in a using-declaration (C:\Users\Kenny\Desktop\1\src\LuaEngine\GameObjectHooks.cpp) C:\Program Files (x86)\Microsoft Visual Studio 12.0\VC\include\cinttypes 23 1 LuaEngine Error 231 error C2065: 'INTMAX_MAX' : undeclared identifier (C:\Users\Kenny\Desktop\1\src\LuaEngine\GameObjectHooks.cpp) C:\Program Files (x86)\Microsoft Visual Studio 12.0\VC\include\ratio 122 1 LuaEngine Error 232 error C2065: 'INTMAX_MAX' : undeclared identifier (C:\Users\Kenny\Desktop\1\src\LuaEngine\GameObjectHooks.cpp) C:\Program Files (x86)\Microsoft Visual Studio 12.0\VC\include\ratio 124 1 LuaEngine Error 233 error C2065: 'INTMAX_MAX' : undeclared identifier (C:\Users\Kenny\Desktop\1\src\LuaEngine\GameObjectHooks.cpp) C:\Program Files (x86)\Microsoft Visual Studio 12.0\VC\include\ratio 44 1 LuaEngine Error 234 error C2338: integer arithmetic overflow (C:\Users\Kenny\Desktop\1\src\LuaEngine\GameObjectHooks.cpp) C:\Program Files (x86)\Microsoft Visual Studio 12.0\VC\include\ratio 36 1 LuaEngine Error 235 error C2039: 'value' : is not a member of 'std::_Safe_multX<0x01,0x01,false>' (C:\Users\Kenny\Desktop\1\src\LuaEngine\GameObjectHooks.cpp) C:\Program Files (x86)\Microsoft Visual Studio 12.0\VC\include\ratio 44 1 LuaEngine Error 236 error C2065: 'value' : undeclared identifier (C:\Users\Kenny\Desktop\1\src\LuaEngine\GameObjectHooks.cpp) C:\Program Files (x86)\Microsoft Visual Studio 12.0\VC\include\ratio 44 1 LuaEngine Error 237 error C2057: expected constant expression (C:\Users\Kenny\Desktop\1\src\LuaEngine\GameObjectHooks.cpp) C:\Program Files (x86)\Microsoft Visual Studio 12.0\VC\include\ratio 44 1 LuaEngine Error 238 error C2039: 'value' : is not a member of 'std::_Safe_multX<0x01,0x0989680,false>' (C:\Users\Kenny\Desktop\1\src\LuaEngine\GameObjectHooks.cpp) C:\Program Files (x86)\Microsoft Visual Studio 12.0\VC\include\ratio 44 1 LuaEngine Error 239 error C2975: '_Nx' : invalid template argument for 'std::ratio', expected compile-time constant expression (C:\Users\Kenny\Desktop\1\src\LuaEngine\GameObjectHooks.cpp) C:\Program Files (x86)\Microsoft Visual Studio 12.0\VC\include\ratio 219 1 LuaEngine Error 240 error C2975: '_Dx' : invalid template argument for 'std::ratio', expected compile-time constant expression (C:\Users\Kenny\Desktop\1\src\LuaEngine\GameObjectHooks.cpp) C:\Program Files (x86)\Microsoft Visual Studio 12.0\VC\include\ratio 219 1 LuaEngine Error 241 error C2039: '_abs64' : is not a member of '`global namespace'' (C:\Users\Kenny\Desktop\1\src\LuaEngine\GossipHooks.cpp) C:\Program Files (x86)\Microsoft Visual Studio 12.0\VC\include\cinttypes 22 1 LuaEngine Error 242 error C2873: '_abs64' : symbol cannot be used in a using-declaration (C:\Users\Kenny\Desktop\1\src\LuaEngine\GossipHooks.cpp) C:\Program Files (x86)\Microsoft Visual Studio 12.0\VC\include\cinttypes 22 1 LuaEngine Error 243 error C2039: '_strtoi64' : is not a member of '`global namespace'' (C:\Users\Kenny\Desktop\1\src\LuaEngine\GossipHooks.cpp) C:\Program Files (x86)\Microsoft Visual Studio 12.0\VC\include\cinttypes 23 1 LuaEngine Error 244 error C2873: '_strtoi64' : symbol cannot be used in a using-declaration (C:\Users\Kenny\Desktop\1\src\LuaEngine\GossipHooks.cpp) C:\Program Files (x86)\Microsoft Visual Studio 12.0\VC\include\cinttypes 23 1 LuaEngine Error 245 error C2039: '_strtoui64' : is not a member of '`global namespace'' (C:\Users\Kenny\Desktop\1\src\LuaEngine\GossipHooks.cpp) C:\Program Files (x86)\Microsoft Visual Studio 12.0\VC\include\cinttypes 23 1 LuaEngine Error 246 error C2873: '_strtoui64' : symbol cannot be used in a using-declaration (C:\Users\Kenny\Desktop\1\src\LuaEngine\GossipHooks.cpp) C:\Program Files (x86)\Microsoft Visual Studio 12.0\VC\include\cinttypes 23 1 LuaEngine Error 247 error C2065: 'INTMAX_MAX' : undeclared identifier (C:\Users\Kenny\Desktop\1\src\LuaEngine\GossipHooks.cpp) C:\Program Files (x86)\Microsoft Visual Studio 12.0\VC\include\ratio 122 1 LuaEngine Error 248 error C2065: 'INTMAX_MAX' : undeclared identifier (C:\Users\Kenny\Desktop\1\src\LuaEngine\GossipHooks.cpp) C:\Program Files (x86)\Microsoft Visual Studio 12.0\VC\include\ratio 124 1 LuaEngine Error 249 error C2065: 'INTMAX_MAX' : undeclared identifier (C:\Users\Kenny\Desktop\1\src\LuaEngine\GossipHooks.cpp) C:\Program Files (x86)\Microsoft Visual Studio 12.0\VC\include\ratio 44 1 LuaEngine Error 250 error C2338: integer arithmetic overflow (C:\Users\Kenny\Desktop\1\src\LuaEngine\GossipHooks.cpp) C:\Program Files (x86)\Microsoft Visual Studio 12.0\VC\include\ratio 36 1 LuaEngine Error 251 error C2039: 'value' : is not a member of 'std::_Safe_multX<0x01,0x01,false>' (C:\Users\Kenny\Desktop\1\src\LuaEngine\GossipHooks.cpp) C:\Program Files (x86)\Microsoft Visual Studio 12.0\VC\include\ratio 44 1 LuaEngine Error 252 error C2065: 'value' : undeclared identifier (C:\Users\Kenny\Desktop\1\src\LuaEngine\GossipHooks.cpp) C:\Program Files (x86)\Microsoft Visual Studio 12.0\VC\include\ratio 44 1 LuaEngine Error 253 error C2057: expected constant expression (C:\Users\Kenny\Desktop\1\src\LuaEngine\GossipHooks.cpp) C:\Program Files (x86)\Microsoft Visual Studio 12.0\VC\include\ratio 44 1 LuaEngine Error 254 error C2039: 'value' : is not a member of 'std::_Safe_multX<0x01,0x0989680,false>' (C:\Users\Kenny\Desktop\1\src\LuaEngine\GossipHooks.cpp) C:\Program Files (x86)\Microsoft Visual Studio 12.0\VC\include\ratio 44 1 LuaEngine Error 255 error C2975: '_Nx' : invalid template argument for 'std::ratio', expected compile-time constant expression (C:\Users\Kenny\Desktop\1\src\LuaEngine\GossipHooks.cpp) C:\Program Files (x86)\Microsoft Visual Studio 12.0\VC\include\ratio 219 1 LuaEngine Error 256 error C2975: '_Dx' : invalid template argument for 'std::ratio', expected compile-time constant expression (C:\Users\Kenny\Desktop\1\src\LuaEngine\GossipHooks.cpp) C:\Program Files (x86)\Microsoft Visual Studio 12.0\VC\include\ratio 219 1 LuaEngine Error 257 error C2338: zero denominator (C:\Users\Kenny\Desktop\1\src\LuaEngine\GameObjectHooks.cpp) C:\Program Files (x86)\Microsoft Visual Studio 12.0\VC\include\ratio 121 1 LuaEngine Error 258 error C2338: zero denominator (C:\Users\Kenny\Desktop\1\src\LuaEngine\ElunaUtility.cpp) C:\Program Files (x86)\Microsoft Visual Studio 12.0\VC\include\ratio 121 1 LuaEngine Error 259 error C2338: zero denominator (C:\Users\Kenny\Desktop\1\src\LuaEngine\GossipHooks.cpp) C:\Program Files (x86)\Microsoft Visual Studio 12.0\VC\include\ratio 121 1 LuaEngine Error 260 error C2039: '_abs64' : is not a member of '`global namespace'' (C:\Users\Kenny\Desktop\1\src\LuaEngine\GroupHooks.cpp) C:\Program Files (x86)\Microsoft Visual Studio 12.0\VC\include\cinttypes 22 1 LuaEngine Error 261 error C2873: '_abs64' : symbol cannot be used in a using-declaration (C:\Users\Kenny\Desktop\1\src\LuaEngine\GroupHooks.cpp) C:\Program Files (x86)\Microsoft Visual Studio 12.0\VC\include\cinttypes 22 1 LuaEngine Error 262 error C2039: '_strtoi64' : is not a member of '`global namespace'' (C:\Users\Kenny\Desktop\1\src\LuaEngine\GroupHooks.cpp) C:\Program Files (x86)\Microsoft Visual Studio 12.0\VC\include\cinttypes 23 1 LuaEngine Error 263 error C2873: '_strtoi64' : symbol cannot be used in a using-declaration (C:\Users\Kenny\Desktop\1\src\LuaEngine\GroupHooks.cpp) C:\Program Files (x86)\Microsoft Visual Studio 12.0\VC\include\cinttypes 23 1 LuaEngine Error 264 error C2039: '_strtoui64' : is not a member of '`global namespace'' (C:\Users\Kenny\Desktop\1\src\LuaEngine\GroupHooks.cpp) C:\Program Files (x86)\Microsoft Visual Studio 12.0\VC\include\cinttypes 23 1 LuaEngine Error 265 error C2873: '_strtoui64' : symbol cannot be used in a using-declaration (C:\Users\Kenny\Desktop\1\src\LuaEngine\GroupHooks.cpp) C:\Program Files (x86)\Microsoft Visual Studio 12.0\VC\include\cinttypes 23 1 LuaEngine Error 266 error C2065: 'INTMAX_MAX' : undeclared identifier (C:\Users\Kenny\Desktop\1\src\LuaEngine\GroupHooks.cpp) C:\Program Files (x86)\Microsoft Visual Studio 12.0\VC\include\ratio 122 1 LuaEngine Error 267 error C2065: 'INTMAX_MAX' : undeclared identifier (C:\Users\Kenny\Desktop\1\src\LuaEngine\GroupHooks.cpp) C:\Program Files (x86)\Microsoft Visual Studio 12.0\VC\include\ratio 124 1 LuaEngine Error 268 error C2065: 'INTMAX_MAX' : undeclared identifier (C:\Users\Kenny\Desktop\1\src\LuaEngine\GroupHooks.cpp) C:\Program Files (x86)\Microsoft Visual Studio 12.0\VC\include\ratio 44 1 LuaEngine Error 269 error C2338: integer arithmetic overflow (C:\Users\Kenny\Desktop\1\src\LuaEngine\GroupHooks.cpp) C:\Program Files (x86)\Microsoft Visual Studio 12.0\VC\include\ratio 36 1 LuaEngine Error 270 error C2039: 'value' : is not a member of 'std::_Safe_multX<0x01,0x01,false>' (C:\Users\Kenny\Desktop\1\src\LuaEngine\GroupHooks.cpp) C:\Program Files (x86)\Microsoft Visual Studio 12.0\VC\include\ratio 44 1 LuaEngine Error 271 error C2065: 'value' : undeclared identifier (C:\Users\Kenny\Desktop\1\src\LuaEngine\GroupHooks.cpp) C:\Program Files (x86)\Microsoft Visual Studio 12.0\VC\include\ratio 44 1 LuaEngine Error 272 error C2057: expected constant expression (C:\Users\Kenny\Desktop\1\src\LuaEngine\GroupHooks.cpp) C:\Program Files (x86)\Microsoft Visual Studio 12.0\VC\include\ratio 44 1 LuaEngine Error 273 error C2039: 'value' : is not a member of 'std::_Safe_multX<0x01,0x0989680,false>' (C:\Users\Kenny\Desktop\1\src\LuaEngine\GroupHooks.cpp) C:\Program Files (x86)\Microsoft Visual Studio 12.0\VC\include\ratio 44 1 LuaEngine Error 274 error C2975: '_Nx' : invalid template argument for 'std::ratio', expected compile-time constant expression (C:\Users\Kenny\Desktop\1\src\LuaEngine\GroupHooks.cpp) C:\Program Files (x86)\Microsoft Visual Studio 12.0\VC\include\ratio 219 1 LuaEngine Error 275 error C2975: '_Dx' : invalid template argument for 'std::ratio', expected compile-time constant expression (C:\Users\Kenny\Desktop\1\src\LuaEngine\GroupHooks.cpp) C:\Program Files (x86)\Microsoft Visual Studio 12.0\VC\include\ratio 219 1 LuaEngine Error 276 error C2338: zero denominator (C:\Users\Kenny\Desktop\1\src\LuaEngine\GroupHooks.cpp) C:\Program Files (x86)\Microsoft Visual Studio 12.0\VC\include\ratio 121 1 LuaEngine Error 277 error C2039: '_abs64' : is not a member of '`global namespace'' (C:\Users\Kenny\Desktop\1\src\LuaEngine\GuildHooks.cpp) C:\Program Files (x86)\Microsoft Visual Studio 12.0\VC\include\cinttypes 22 1 LuaEngine Error 278 error C2873: '_abs64' : symbol cannot be used in a using-declaration (C:\Users\Kenny\Desktop\1\src\LuaEngine\GuildHooks.cpp) C:\Program Files (x86)\Microsoft Visual Studio 12.0\VC\include\cinttypes 22 1 LuaEngine Error 279 error C2039: '_strtoi64' : is not a member of '`global namespace'' (C:\Users\Kenny\Desktop\1\src\LuaEngine\GuildHooks.cpp) C:\Program Files (x86)\Microsoft Visual Studio 12.0\VC\include\cinttypes 23 1 LuaEngine Error 280 error C2873: '_strtoi64' : symbol cannot be used in a using-declaration (C:\Users\Kenny\Desktop\1\src\LuaEngine\GuildHooks.cpp) C:\Program Files (x86)\Microsoft Visual Studio 12.0\VC\include\cinttypes 23 1 LuaEngine Error 281 error C2039: '_strtoui64' : is not a member of '`global namespace'' (C:\Users\Kenny\Desktop\1\src\LuaEngine\GuildHooks.cpp) C:\Program Files (x86)\Microsoft Visual Studio 12.0\VC\include\cinttypes 23 1 LuaEngine Error 282 error C2873: '_strtoui64' : symbol cannot be used in a using-declaration (C:\Users\Kenny\Desktop\1\src\LuaEngine\GuildHooks.cpp) C:\Program Files (x86)\Microsoft Visual Studio 12.0\VC\include\cinttypes 23 1 LuaEngine Error 283 error C2065: 'INTMAX_MAX' : undeclared identifier (C:\Users\Kenny\Desktop\1\src\LuaEngine\GuildHooks.cpp) C:\Program Files (x86)\Microsoft Visual Studio 12.0\VC\include\ratio 122 1 LuaEngine Error 284 error C2065: 'INTMAX_MAX' : undeclared identifier (C:\Users\Kenny\Desktop\1\src\LuaEngine\GuildHooks.cpp) C:\Program Files (x86)\Microsoft Visual Studio 12.0\VC\include\ratio 124 1 LuaEngine Error 285 error C2065: 'INTMAX_MAX' : undeclared identifier (C:\Users\Kenny\Desktop\1\src\LuaEngine\GuildHooks.cpp) C:\Program Files (x86)\Microsoft Visual Studio 12.0\VC\include\ratio 44 1 LuaEngine Error 286 error C2338: integer arithmetic overflow (C:\Users\Kenny\Desktop\1\src\LuaEngine\GuildHooks.cpp) C:\Program Files (x86)\Microsoft Visual Studio 12.0\VC\include\ratio 36 1 LuaEngine Error 287 error C2039: 'value' : is not a member of 'std::_Safe_multX<0x01,0x01,false>' (C:\Users\Kenny\Desktop\1\src\LuaEngine\GuildHooks.cpp) C:\Program Files (x86)\Microsoft Visual Studio 12.0\VC\include\ratio 44 1 LuaEngine Error 288 error C2065: 'value' : undeclared identifier (C:\Users\Kenny\Desktop\1\src\LuaEngine\GuildHooks.cpp) C:\Program Files (x86)\Microsoft Visual Studio 12.0\VC\include\ratio 44 1 LuaEngine Error 289 error C2057: expected constant expression (C:\Users\Kenny\Desktop\1\src\LuaEngine\GuildHooks.cpp) C:\Program Files (x86)\Microsoft Visual Studio 12.0\VC\include\ratio 44 1 LuaEngine Error 290 error C2039: 'value' : is not a member of 'std::_Safe_multX<0x01,0x0989680,false>' (C:\Users\Kenny\Desktop\1\src\LuaEngine\GuildHooks.cpp) C:\Program Files (x86)\Microsoft Visual Studio 12.0\VC\include\ratio 44 1 LuaEngine Error 291 error C2975: '_Nx' : invalid template argument for 'std::ratio', expected compile-time constant expression (C:\Users\Kenny\Desktop\1\src\LuaEngine\GuildHooks.cpp) C:\Program Files (x86)\Microsoft Visual Studio 12.0\VC\include\ratio 219 1 LuaEngine Error 292 error C2975: '_Dx' : invalid template argument for 'std::ratio', expected compile-time constant expression (C:\Users\Kenny\Desktop\1\src\LuaEngine\GuildHooks.cpp) C:\Program Files (x86)\Microsoft Visual Studio 12.0\VC\include\ratio 219 1 LuaEngine Error 293 error C2338: zero denominator (C:\Users\Kenny\Desktop\1\src\LuaEngine\GuildHooks.cpp) C:\Program Files (x86)\Microsoft Visual Studio 12.0\VC\include\ratio 121 1 LuaEngine Error 294 error C2039: '_abs64' : is not a member of '`global namespace'' (C:\Users\Kenny\Desktop\1\src\LuaEngine\InstanceHooks.cpp) C:\Program Files (x86)\Microsoft Visual Studio 12.0\VC\include\cinttypes 22 1 LuaEngine Error 295 error C2873: '_abs64' : symbol cannot be used in a using-declaration (C:\Users\Kenny\Desktop\1\src\LuaEngine\InstanceHooks.cpp) C:\Program Files (x86)\Microsoft Visual Studio 12.0\VC\include\cinttypes 22 1 LuaEngine Error 296 error C2039: '_strtoi64' : is not a member of '`global namespace'' (C:\Users\Kenny\Desktop\1\src\LuaEngine\InstanceHooks.cpp) C:\Program Files (x86)\Microsoft Visual Studio 12.0\VC\include\cinttypes 23 1 LuaEngine Error 297 error C2873: '_strtoi64' : symbol cannot be used in a using-declaration (C:\Users\Kenny\Desktop\1\src\LuaEngine\InstanceHooks.cpp) C:\Program Files (x86)\Microsoft Visual Studio 12.0\VC\include\cinttypes 23 1 LuaEngine Error 298 error C2039: '_strtoui64' : is not a member of '`global namespace'' (C:\Users\Kenny\Desktop\1\src\LuaEngine\InstanceHooks.cpp) C:\Program Files (x86)\Microsoft Visual Studio 12.0\VC\include\cinttypes 23 1 LuaEngine Error 299 error C2873: '_strtoui64' : symbol cannot be used in a using-declaration (C:\Users\Kenny\Desktop\1\src\LuaEngine\InstanceHooks.cpp) C:\Program Files (x86)\Microsoft Visual Studio 12.0\VC\include\cinttypes 23 1 LuaEngine Error 300 error C2065: 'INTMAX_MAX' : undeclared identifier (C:\Users\Kenny\Desktop\1\src\LuaEngine\InstanceHooks.cpp) C:\Program Files (x86)\Microsoft Visual Studio 12.0\VC\include\ratio 122 1 LuaEngine Error 301 error C2065: 'INTMAX_MAX' : undeclared identifier (C:\Users\Kenny\Desktop\1\src\LuaEngine\InstanceHooks.cpp) C:\Program Files (x86)\Microsoft Visual Studio 12.0\VC\include\ratio 124 1 LuaEngine Error 302 error C2065: 'INTMAX_MAX' : undeclared identifier (C:\Users\Kenny\Desktop\1\src\LuaEngine\InstanceHooks.cpp) C:\Program Files (x86)\Microsoft Visual Studio 12.0\VC\include\ratio 44 1 LuaEngine Error 303 error C2338: integer arithmetic overflow (C:\Users\Kenny\Desktop\1\src\LuaEngine\InstanceHooks.cpp) C:\Program Files (x86)\Microsoft Visual Studio 12.0\VC\include\ratio 36 1 LuaEngine Error 304 error C2039: 'value' : is not a member of 'std::_Safe_multX<0x01,0x01,false>' (C:\Users\Kenny\Desktop\1\src\LuaEngine\InstanceHooks.cpp) C:\Program Files (x86)\Microsoft Visual Studio 12.0\VC\include\ratio 44 1 LuaEngine Error 305 error C2065: 'value' : undeclared identifier (C:\Users\Kenny\Desktop\1\src\LuaEngine\InstanceHooks.cpp) C:\Program Files (x86)\Microsoft Visual Studio 12.0\VC\include\ratio 44 1 LuaEngine Error 306 error C2057: expected constant expression (C:\Users\Kenny\Desktop\1\src\LuaEngine\InstanceHooks.cpp) C:\Program Files (x86)\Microsoft Visual Studio 12.0\VC\include\ratio 44 1 LuaEngine Error 307 error C2039: 'value' : is not a member of 'std::_Safe_multX<0x01,0x0989680,false>' (C:\Users\Kenny\Desktop\1\src\LuaEngine\InstanceHooks.cpp) C:\Program Files (x86)\Microsoft Visual Studio 12.0\VC\include\ratio 44 1 LuaEngine Error 308 error C2975: '_Nx' : invalid template argument for 'std::ratio', expected compile-time constant expression (C:\Users\Kenny\Desktop\1\src\LuaEngine\InstanceHooks.cpp) C:\Program Files (x86)\Microsoft Visual Studio 12.0\VC\include\ratio 219 1 LuaEngine Error 309 error C2975: '_Dx' : invalid template argument for 'std::ratio', expected compile-time constant expression (C:\Users\Kenny\Desktop\1\src\LuaEngine\InstanceHooks.cpp) C:\Program Files (x86)\Microsoft Visual Studio 12.0\VC\include\ratio 219 1 LuaEngine Error 310 error C2338: zero denominator (C:\Users\Kenny\Desktop\1\src\LuaEngine\InstanceHooks.cpp) C:\Program Files (x86)\Microsoft Visual Studio 12.0\VC\include\ratio 121 1 LuaEngine Error 311 error C2039: '_abs64' : is not a member of '`global namespace'' C:\Program Files (x86)\Microsoft Visual Studio 12.0\VC\include\cinttypes 22 1 authserver Error 312 error C2873: '_abs64' : symbol cannot be used in a using-declaration C:\Program Files (x86)\Microsoft Visual Studio 12.0\VC\include\cinttypes 22 1 authserver Error 313 error C2039: '_strtoi64' : is not a member of '`global namespace'' C:\Program Files (x86)\Microsoft Visual Studio 12.0\VC\include\cinttypes 23 1 authserver Error 314 error C2873: '_strtoi64' : symbol cannot be used in a using-declaration C:\Program Files (x86)\Microsoft Visual Studio 12.0\VC\include\cinttypes 23 1 authserver Error 315 error C2039: '_strtoui64' : is not a member of '`global namespace'' C:\Program Files (x86)\Microsoft Visual Studio 12.0\VC\include\cinttypes 23 1 authserver Error 316 error C2873: '_strtoui64' : symbol cannot be used in a using-declaration C:\Program Files (x86)\Microsoft Visual Studio 12.0\VC\include\cinttypes 23 1 authserver Error 317 error C2065: 'INTMAX_MAX' : undeclared identifier C:\Program Files (x86)\Microsoft Visual Studio 12.0\VC\include\ratio 122 1 authserver Error 318 error C2065: 'INTMAX_MAX' : undeclared identifier C:\Program Files (x86)\Microsoft Visual Studio 12.0\VC\include\ratio 124 1 authserver Error 319 error C2065: 'INTMAX_MAX' : undeclared identifier C:\Program Files (x86)\Microsoft Visual Studio 12.0\VC\include\ratio 44 1 authserver Error 320 error C2338: integer arithmetic overflow C:\Program Files (x86)\Microsoft Visual Studio 12.0\VC\include\ratio 36 1 authserver Error 321 error C2039: 'value' : is not a member of 'std::_Safe_multX<0x01,0x01,false>' C:\Program Files (x86)\Microsoft Visual Studio 12.0\VC\include\ratio 44 1 authserver Error 322 error C2065: 'value' : undeclared identifier C:\Program Files (x86)\Microsoft Visual Studio 12.0\VC\include\ratio 44 1 authserver Error 323 error C2057: expected constant expression C:\Program Files (x86)\Microsoft Visual Studio 12.0\VC\include\ratio 44 1 authserver Error 324 error C2039: 'value' : is not a member of 'std::_Safe_multX<0x01,0x0989680,false>' C:\Program Files (x86)\Microsoft Visual Studio 12.0\VC\include\ratio 44 1 authserver Error 325 error C2975: '_Nx' : invalid template argument for 'std::ratio', expected compile-time constant expression C:\Program Files (x86)\Microsoft Visual Studio 12.0\VC\include\ratio 219 1 authserver Error 326 error C2975: '_Dx' : invalid template argument for 'std::ratio', expected compile-time constant expression C:\Program Files (x86)\Microsoft Visual Studio 12.0\VC\include\ratio 219 1 authserver Error 327 error C2039: '_abs64' : is not a member of '`global namespace'' (C:\Users\Kenny\Desktop\1\src\LuaEngine\ItemHooks.cpp) C:\Program Files (x86)\Microsoft Visual Studio 12.0\VC\include\cinttypes 22 1 LuaEngine Error 328 error C2873: '_abs64' : symbol cannot be used in a using-declaration (C:\Users\Kenny\Desktop\1\src\LuaEngine\ItemHooks.cpp) C:\Program Files (x86)\Microsoft Visual Studio 12.0\VC\include\cinttypes 22 1 LuaEngine Error 329 error C2039: '_strtoi64' : is not a member of '`global namespace'' (C:\Users\Kenny\Desktop\1\src\LuaEngine\ItemHooks.cpp) C:\Program Files (x86)\Microsoft Visual Studio 12.0\VC\include\cinttypes 23 1 LuaEngine Error 330 error C2873: '_strtoi64' : symbol cannot be used in a using-declaration (C:\Users\Kenny\Desktop\1\src\LuaEngine\ItemHooks.cpp) C:\Program Files (x86)\Microsoft Visual Studio 12.0\VC\include\cinttypes 23 1 LuaEngine Error 331 error C2039: '_strtoui64' : is not a member of '`global namespace'' (C:\Users\Kenny\Desktop\1\src\LuaEngine\ItemHooks.cpp) C:\Program Files (x86)\Microsoft Visual Studio 12.0\VC\include\cinttypes 23 1 LuaEngine Error 332 error C2873: '_strtoui64' : symbol cannot be used in a using-declaration (C:\Users\Kenny\Desktop\1\src\LuaEngine\ItemHooks.cpp) C:\Program Files (x86)\Microsoft Visual Studio 12.0\VC\include\cinttypes 23 1 LuaEngine Error 333 error C2065: 'INTMAX_MAX' : undeclared identifier (C:\Users\Kenny\Desktop\1\src\LuaEngine\ItemHooks.cpp) C:\Program Files (x86)\Microsoft Visual Studio 12.0\VC\include\ratio 122 1 LuaEngine Error 334 error C2065: 'INTMAX_MAX' : undeclared identifier (C:\Users\Kenny\Desktop\1\src\LuaEngine\ItemHooks.cpp) C:\Program Files (x86)\Microsoft Visual Studio 12.0\VC\include\ratio 124 1 LuaEngine Error 335 error C2065: 'INTMAX_MAX' : undeclared identifier (C:\Users\Kenny\Desktop\1\src\LuaEngine\ItemHooks.cpp) C:\Program Files (x86)\Microsoft Visual Studio 12.0\VC\include\ratio 44 1 LuaEngine Error 336 error C2338: integer arithmetic overflow (C:\Users\Kenny\Desktop\1\src\LuaEngine\ItemHooks.cpp) C:\Program Files (x86)\Microsoft Visual Studio 12.0\VC\include\ratio 36 1 LuaEngine Error 337 error C2039: 'value' : is not a member of 'std::_Safe_multX<0x01,0x01,false>' (C:\Users\Kenny\Desktop\1\src\LuaEngine\ItemHooks.cpp) C:\Program Files (x86)\Microsoft Visual Studio 12.0\VC\include\ratio 44 1 LuaEngine Error 338 error C2065: 'value' : undeclared identifier (C:\Users\Kenny\Desktop\1\src\LuaEngine\ItemHooks.cpp) C:\Program Files (x86)\Microsoft Visual Studio 12.0\VC\include\ratio 44 1 LuaEngine Error 339 error C2057: expected constant expression (C:\Users\Kenny\Desktop\1\src\LuaEngine\ItemHooks.cpp) C:\Program Files (x86)\Microsoft Visual Studio 12.0\VC\include\ratio 44 1 LuaEngine Error 340 error C2039: 'value' : is not a member of 'std::_Safe_multX<0x01,0x0989680,false>' (C:\Users\Kenny\Desktop\1\src\LuaEngine\ItemHooks.cpp) C:\Program Files (x86)\Microsoft Visual Studio 12.0\VC\include\ratio 44 1 LuaEngine Error 341 error C2975: '_Nx' : invalid template argument for 'std::ratio', expected compile-time constant expression (C:\Users\Kenny\Desktop\1\src\LuaEngine\ItemHooks.cpp) C:\Program Files (x86)\Microsoft Visual Studio 12.0\VC\include\ratio 219 1 LuaEngine Error 342 error C2975: '_Dx' : invalid template argument for 'std::ratio', expected compile-time constant expression (C:\Users\Kenny\Desktop\1\src\LuaEngine\ItemHooks.cpp) C:\Program Files (x86)\Microsoft Visual Studio 12.0\VC\include\ratio 219 1 LuaEngine Error 343 error C2338: zero denominator (C:\Users\Kenny\Desktop\1\src\LuaEngine\ItemHooks.cpp) C:\Program Files (x86)\Microsoft Visual Studio 12.0\VC\include\ratio 121 1 LuaEngine Error 344 error C2065: 'UINT32_MAX' : undeclared identifier C:\Users\Kenny\Desktop\1\src\LuaEngine\lmarshal.cpp 81 1 LuaEngine Error 345 error C2039: '_abs64' : is not a member of '`global namespace'' (C:\Users\Kenny\Desktop\1\src\LuaEngine\LuaEngine.cpp) C:\Program Files (x86)\Microsoft Visual Studio 12.0\VC\include\cinttypes 22 1 LuaEngine Error 346 error C2873: '_abs64' : symbol cannot be used in a using-declaration (C:\Users\Kenny\Desktop\1\src\LuaEngine\LuaEngine.cpp) C:\Program Files (x86)\Microsoft Visual Studio 12.0\VC\include\cinttypes 22 1 LuaEngine Error 347 error C2039: '_strtoi64' : is not a member of '`global namespace'' (C:\Users\Kenny\Desktop\1\src\LuaEngine\LuaEngine.cpp) C:\Program Files (x86)\Microsoft Visual Studio 12.0\VC\include\cinttypes 23 1 LuaEngine Error 348 error C2873: '_strtoi64' : symbol cannot be used in a using-declaration (C:\Users\Kenny\Desktop\1\src\LuaEngine\LuaEngine.cpp) C:\Program Files (x86)\Microsoft Visual Studio 12.0\VC\include\cinttypes 23 1 LuaEngine Error 349 error C2039: '_strtoui64' : is not a member of '`global namespace'' (C:\Users\Kenny\Desktop\1\src\LuaEngine\LuaEngine.cpp) C:\Program Files (x86)\Microsoft Visual Studio 12.0\VC\include\cinttypes 23 1 LuaEngine Error 350 error C2873: '_strtoui64' : symbol cannot be used in a using-declaration (C:\Users\Kenny\Desktop\1\src\LuaEngine\LuaEngine.cpp) C:\Program Files (x86)\Microsoft Visual Studio 12.0\VC\include\cinttypes 23 1 LuaEngine Error 351 error C2039: '_abs64' : is not a member of '`global namespace'' (C:\Users\Kenny\Desktop\1\src\LuaEngine\LuaFunctions.cpp) C:\Program Files (x86)\Microsoft Visual Studio 12.0\VC\include\cinttypes 22 1 LuaEngine Error 352 error C2873: '_abs64' : symbol cannot be used in a using-declaration (C:\Users\Kenny\Desktop\1\src\LuaEngine\LuaFunctions.cpp) C:\Program Files (x86)\Microsoft Visual Studio 12.0\VC\include\cinttypes 22 1 LuaEngine Error 353 error C2039: '_strtoi64' : is not a member of '`global namespace'' (C:\Users\Kenny\Desktop\1\src\LuaEngine\LuaFunctions.cpp) C:\Program Files (x86)\Microsoft Visual Studio 12.0\VC\include\cinttypes 23 1 LuaEngine Error 354 error C2873: '_strtoi64' : symbol cannot be used in a using-declaration (C:\Users\Kenny\Desktop\1\src\LuaEngine\LuaFunctions.cpp) C:\Program Files (x86)\Microsoft Visual Studio 12.0\VC\include\cinttypes 23 1 LuaEngine Error 355 error C2039: '_strtoui64' : is not a member of '`global namespace'' (C:\Users\Kenny\Desktop\1\src\LuaEngine\LuaFunctions.cpp) C:\Program Files (x86)\Microsoft Visual Studio 12.0\VC\include\cinttypes 23 1 LuaEngine Error 356 error C2873: '_strtoui64' : symbol cannot be used in a using-declaration (C:\Users\Kenny\Desktop\1\src\LuaEngine\LuaFunctions.cpp) C:\Program Files (x86)\Microsoft Visual Studio 12.0\VC\include\cinttypes 23 1 LuaEngine Error 357 error C2065: 'INTMAX_MAX' : undeclared identifier (C:\Users\Kenny\Desktop\1\src\LuaEngine\LuaEngine.cpp) C:\Program Files (x86)\Microsoft Visual Studio 12.0\VC\include\ratio 122 1 LuaEngine Error 358 error C2065: 'INTMAX_MAX' : undeclared identifier (C:\Users\Kenny\Desktop\1\src\LuaEngine\LuaEngine.cpp) C:\Program Files (x86)\Microsoft Visual Studio 12.0\VC\include\ratio 124 1 LuaEngine Error 359 error C2065: 'INTMAX_MAX' : undeclared identifier (C:\Users\Kenny\Desktop\1\src\LuaEngine\LuaEngine.cpp) C:\Program Files (x86)\Microsoft Visual Studio 12.0\VC\include\ratio 44 1 LuaEngine Error 360 error C2338: integer arithmetic overflow (C:\Users\Kenny\Desktop\1\src\LuaEngine\LuaEngine.cpp) C:\Program Files (x86)\Microsoft Visual Studio 12.0\VC\include\ratio 36 1 LuaEngine Error 361 error C2039: 'value' : is not a member of 'std::_Safe_multX<0x01,0x01,false>' (C:\Users\Kenny\Desktop\1\src\LuaEngine\LuaEngine.cpp) C:\Program Files (x86)\Microsoft Visual Studio 12.0\VC\include\ratio 44 1 LuaEngine Error 362 error C2065: 'value' : undeclared identifier (C:\Users\Kenny\Desktop\1\src\LuaEngine\LuaEngine.cpp) C:\Program Files (x86)\Microsoft Visual Studio 12.0\VC\include\ratio 44 1 LuaEngine Error 363 error C2057: expected constant expression (C:\Users\Kenny\Desktop\1\src\LuaEngine\LuaEngine.cpp) C:\Program Files (x86)\Microsoft Visual Studio 12.0\VC\include\ratio 44 1 LuaEngine Error 364 error C2039: 'value' : is not a member of 'std::_Safe_multX<0x01,0x0989680,false>' (C:\Users\Kenny\Desktop\1\src\LuaEngine\LuaEngine.cpp) C:\Program Files (x86)\Microsoft Visual Studio 12.0\VC\include\ratio 44 1 LuaEngine Error 365 error C2975: '_Nx' : invalid template argument for 'std::ratio', expected compile-time constant expression (C:\Users\Kenny\Desktop\1\src\LuaEngine\LuaEngine.cpp) C:\Program Files (x86)\Microsoft Visual Studio 12.0\VC\include\ratio 219 1 LuaEngine Error 366 error C2975: '_Dx' : invalid template argument for 'std::ratio', expected compile-time constant expression (C:\Users\Kenny\Desktop\1\src\LuaEngine\LuaEngine.cpp) C:\Program Files (x86)\Microsoft Visual Studio 12.0\VC\include\ratio 219 1 LuaEngine Error 367 error C2065: 'INTMAX_MAX' : undeclared identifier (C:\Users\Kenny\Desktop\1\src\LuaEngine\LuaFunctions.cpp) C:\Program Files (x86)\Microsoft Visual Studio 12.0\VC\include\ratio 122 1 LuaEngine Error 368 error C2065: 'INTMAX_MAX' : undeclared identifier (C:\Users\Kenny\Desktop\1\src\LuaEngine\LuaFunctions.cpp) C:\Program Files (x86)\Microsoft Visual Studio 12.0\VC\include\ratio 124 1 LuaEngine Error 369 error C2065: 'INTMAX_MAX' : undeclared identifier (C:\Users\Kenny\Desktop\1\src\LuaEngine\LuaFunctions.cpp) C:\Program Files (x86)\Microsoft Visual Studio 12.0\VC\include\ratio 44 1 LuaEngine Error 370 error C2338: integer arithmetic overflow (C:\Users\Kenny\Desktop\1\src\LuaEngine\LuaFunctions.cpp) C:\Program Files (x86)\Microsoft Visual Studio 12.0\VC\include\ratio 36 1 LuaEngine Error 371 error C2039: 'value' : is not a member of 'std::_Safe_multX<0x01,0x01,false>' (C:\Users\Kenny\Desktop\1\src\LuaEngine\LuaFunctions.cpp) C:\Program Files (x86)\Microsoft Visual Studio 12.0\VC\include\ratio 44 1 LuaEngine Error 372 error C2065: 'value' : undeclared identifier (C:\Users\Kenny\Desktop\1\src\LuaEngine\LuaFunctions.cpp) C:\Program Files (x86)\Microsoft Visual Studio 12.0\VC\include\ratio 44 1 LuaEngine Error 373 error C2057: expected constant expression (C:\Users\Kenny\Desktop\1\src\LuaEngine\LuaFunctions.cpp) C:\Program Files (x86)\Microsoft Visual Studio 12.0\VC\include\ratio 44 1 LuaEngine Error 374 error C2039: 'value' : is not a member of 'std::_Safe_multX<0x01,0x0989680,false>' (C:\Users\Kenny\Desktop\1\src\LuaEngine\LuaFunctions.cpp) C:\Program Files (x86)\Microsoft Visual Studio 12.0\VC\include\ratio 44 1 LuaEngine Error 375 error C2975: '_Nx' : invalid template argument for 'std::ratio', expected compile-time constant expression (C:\Users\Kenny\Desktop\1\src\LuaEngine\LuaFunctions.cpp) C:\Program Files (x86)\Microsoft Visual Studio 12.0\VC\include\ratio 219 1 LuaEngine Error 376 error C2975: '_Dx' : invalid template argument for 'std::ratio', expected compile-time constant expression (C:\Users\Kenny\Desktop\1\src\LuaEngine\LuaFunctions.cpp) C:\Program Files (x86)\Microsoft Visual Studio 12.0\VC\include\ratio 219 1 LuaEngine Error 377 error C2338: zero denominator (C:\Users\Kenny\Desktop\1\src\LuaEngine\LuaEngine.cpp) C:\Program Files (x86)\Microsoft Visual Studio 12.0\VC\include\ratio 121 1 LuaEngine Error 378 error C2338: zero denominator (C:\Users\Kenny\Desktop\1\src\LuaEngine\LuaFunctions.cpp) C:\Program Files (x86)\Microsoft Visual Studio 12.0\VC\include\ratio 121 1 LuaEngine
  18. Hello! I had a question regarding the Sons of Hodir reputation entry in the database. It didn't seem like an issue since it's working correctly in game, so I didn't want to open anything on GitHub, but I do want to understand how it works just so I can wrap my brain around it. On my server, I have a character who is somewhere into Honored with the Sons of Hodir. When I look in the character_reputation table in the database, though, their faction standing is set to 51175, which if I'm not mistaken is somewhere above the reputation cap. Other factions seem to work as I would expect them to, which is why I'm confused. Am I just misunderstanding how reputations are calculated or am I missing something obvious here?
  19. Hi, System: Mac OS El Capitan 10.11.2 I have followed this guide: https://community.trinitycore.org/topic/10515-howto-compile-trinitycore-on-mac-os-x-using-homebrew/ to build Trinity. My build succeeded after a tweak of myself (changing mysql path). First issue occurred: What did I actually just build? Some kind of Trinity base that is necessary no matter if I want to run 3.3.5 or 6.x? If it does matter, how could I chose JUST to install 3.3.5, I couldn't find that in the guide. Anyway, my build succeeded and I went straight into the next step (server setup): https://trinitycore.atlassian.net/wiki/display/tc/Server+Setup Now a few new problems appear for me: I should extract Vmps, MMaps using Trinity extractors. At first DTOOLS=1 was not set, because it was not mentioned in the guide above. I tried to re-run the 'CMake-Config-Thing' but after adding -DTOOLS=1 at the end of the parameter list and paste it into the console it executes it directly... apparently without using the last parameter. If I add -DTOOLS=1 somewhere inside, it also executes everything directly but leaving out the last parameter which is then of course "-DWITH_WARNINGS=1". Why does the console executes it directly? How do I install/build the extractors and where to find them afterwards and how to use 'em? In the guide it says "unknown makro: 'localtabgroup'", I guess the wiki page is somehow corrupt? Well, I was going through this tutorial because I have no idea and now something essentiell is missing -.- For the moment my build succeeded, but I don't know if it contains everything necessary and whether its prepared for 3.3.5, 6.x or both of them. Which are the next steps from now on to get me past WoW Login Screen? I hope someone can help me out! I'd suppose a lot of people encountered similar problems and might have fixed them already. Thanks in advance, chakuze
  20. Hi, I recently got a 3.3.5 server running on Mac OS. I would like to set up a second, independent realm now (selectable via realmlist menu inside WoW). What are the necessary steps to achieve it? I cannot simply copy everything, because the worldserver after copying, still refers to the same worldserver.conf. I searched the forums and couldn't find something helpful therefore I would appreciate a bit more detailed answer, as it might be useful for other user later aswell. Thanks in advance !
  21. Hey there everyone, so I looked all around the web to see if anybody else has had this issue I am experiencing but i have come up empty on the search. Basically what is happening is every few days (2-3) the local_broadcast_texts and local_page_text and serveral other "local" tables are increasing in size at a rate that clearly is not normal. We always keep our DB update and have long been using trinity core with out issue, so such an issue is quite odd to us. Starting with a fresh DB is not an option because of all of our work, so i was hoping someone here could point me in the direction to find the cause of this so we can address and fix it. I appreciate any help in advance,
  22. Rouge's poisons are dissapearing after a arena, but only the ones who are in the bag, how can I fix this problem? I'm not even sure of how to get to the arena code here, any help will be apreciated. I'm not sure what REV the server I'm playin in uses (Already ask'd just tmie to get the answer) but if we have to make a guess lets say its the latest. Can someone identify why this bug might happend?
  23. So, I currently have a 3.3.5 core which doesn't have RBAC included. (Wierd, I know right?), Anyway, my pinfo command isn't working, i even tried editing the cs_misc.cpp file to get pinfo to work correctly like i had to do with gm vis. Anyway, I think the solution would be adding RBAC into this core, But does anybody know how i can do that and get it to work while also keeping all of my stuff how it is? or just simply able to fix my pinfo issue. https://gyazo.com/d3903eb3df67d6dfc3a49ed1b74ed705 - Here you will see what pinfo shows and doesnt show.
  24. In looking through the database and testing quests, I've found a few that are deprecated (and labelled as such). Are these outdated quests being left in the database for a reason, or just doesn't help anything to remove them? Simply wondering whether I should report these or just leave them be. Thanks!
  25. I have configured everything and when i try to start worldserver.exe it immediately crashes. This is the log TrinityCore rev. e2974746aed7+ 2015-07-21 12:43:27 +0200 (3.3.5 branch) (Win32, Release) (worldserver-daemon) <Ctrl-C> to stop. ______ __ /\__ _\ __ __/\ \__ \/_/\ \/ _ __ /\_\ ___ /\_\ \, _\ __ __ \ \ \/\`'__\/\ \ /' _ `\/\ \ \ \/ /\ \/\ \ \ \ \ \ \/ \ \ \/\ \/\ \ \ \ \ \_\ \ \_\ \ \ \_\ \_\ \ \_\ \_\ \_\ \_\ \__\\/`____ \ \/_/\/_/ \/_/\/_/\/_/\/_/\/__/ `/___/> \ C O R E /\___/ http://TrinityCore.org \/__/ Using configuration file worldserver.conf. Using SSL version: OpenSSL 1.0.2d 9 Jul 2015 (library: OpenSSL 1.0.2d 9 Jul 2015) Using Boost version: 1.57.0 Automatic database updates are disabled for all databases! Realm running as realm ID 1 Using World DB: TDB 335.59 Will clear `logs` table of entries older than 1209600 seconds every 10 minutes. Using DataDir ./ WORLD: MMap data directory is: ./mmaps VMap height checking disabled! Creatures movements and other various things WILL be broken! Expect no support. VMap support included. LineOfSight: 0, getHeight: 0, indoorCheck: 0 VMap data directory is: ./vmaps
×
×
  • Create New...